{"text_format":"1","workbook":"xlsx","n_sheets":12,"sheets":["Read","Part B","Update Info","Input2","Exhibit","Exhibit Totals","Blaney Calc","Crop Count","climo data","crop k's","Irr System","InputControl"],"not_rendered":{"charts":0,"images":1,"macros":1,"external_links":0,"defined_names":9,"comments":0,"pivot_tables":0},"unopened":[],"bounds":{"document_bytes":16777216,"sheet_cells":100000,"rows_first":2000,"rows_last":500,"rows_between":2000,"halvings":0,"cell_chars":16384,"cell_head_chars":4096},"cells_cut":0,"cells_raw":0,"read":"whole","date_system":"1900"}

{"sheet":"Read","index":0,"n_rows":16,"n_cols":4,"rows_kept":16,"cut":false,"hidden":false,"merged":[]}
[]
[]
[null,null,null,"Modified Blaney-Criddle for Excel"]
[]
[]
[null,null,null,"This allocation program which calculates a maximum monthly supplemental crop requirement and an average annual supplemental requirement using the Modified Blaney-Criddle method."]
[null,null,null,"The District assumes no responsibility to the user for the accuracy of this program. The District advises the user that additional information is available in the Basis of Review Volume III."]
[null,null,null,"There may be discrepancies between the result obtained by the user(s) and those results obtained by the District."]
[]
[null,null,null," This program was updated on February, 2014"]
[]
[]
[null,null,null,"Worksheet Developed by Jeffery Scott"]
[]
[null,null,null,"Questions Concerning the Worksheet:"]
[null,null,null,"Please Contact Jeffery Scott at SFWMD West Palm Beach Office 1-800-432-2045 Ext. 6924 or E-mail jscott@sfwmd.gov"]

{"sheet":"Part B","index":1,"n_rows":459,"n_cols":13,"rows_kept":459,"cut":false,"hidden":false,"merged":[[159,0,159,12],[161,0,162,12],[172,0,172,12],[174,0,176,0],[174,1,176,1],[174,2,176,4],[174,5,176,5],[174,6,176,6],[174,7,174,10],[174,11,176,11],[174,12,176,12],[175,7,175,10],[176,7,176,10],[177,0,178,0],[177,1,178,1],[177,2,178,4],[177,5,178,5],[177,6,178,6],[177,7,177,10],[177,11,178,11],[254,1,254,12],[177,12,178,12],[178,7,178,10],[221,1,221,12],[222,1,222,12],[229,1,229,12],[230,1,230,12],[237,1,237,12],[238,1,238,12],[245,1,245,12],[246,1,246,12],[253,1,253,12],[309,1,309,12],[261,1,261,12],[262,1,262,12],[276,1,276,12],[277,1,277,12],[284,1,284,12],[285,1,285,12],[292,1,292,12],[293,1,293,12],[300,1,300,12],[301,1,301,12],[308,1,308,12],[363,1,363,12],[316,1,316,12],[317,1,317,12],[331,1,331,12],[332,1,332,12],[338,1,338,12],[339,1,339,12],[346,1,346,12],[347,1,347,12],[354,1,354,12],[355,1,355,12],[362,1,362,12],[419,1,419,12],[370,1,370,12],[371,1,371,12],[386,1,386,12],[387,1,387,12],[394,1,394,12],[395,1,395,12],[402,1,402,12],[403,1,403,12],[410,1,410,12],[411,1,411,12],[418,1,418,12],[450,1,450,12],[457,1,457,12],[458,1,458,12],[426,1,426,12],[427,1,427,12],[441,1,441,12],[442,1,442,12],[449,1,449,12]]}
[]
[]
[]
[null,null,null,null,null,null,null,"PART B"]
[]
[null,null,null,null,null,null,null,"WATER USE MANAGEMENT SYSTEM"]
[null,null,null,null,null,null,null,"DESIGN AND EVALUATION AIDS"]
[]
[null,null,null,null,null,null,null,"V.  SUPPLEMENTAL CROP REQUIREMENT"]
[null,null,null,null,null,null,null,"AND"]
[null,null,null,null,null,null,null,"WITHDRAWAL CALCULATION"]
[]
[null,null,null,null,null,null,null,"SUPPLEMENTAL CROP REQUIREMENT AND "]
[null,null,null,null,null,null,null,"WITHDRAWAL CALCULATION"]
[]
["Introduction"]
[]
["The Water Use Division of the South Florida Water Management District uses a modified Blaney-Criddle equation to "]
["determine evapotranspiration and the Soil Conservation Service method described below to determine supplemental"]
[" irrigation needs."]
[]
["1.   The Modified Blaney-Criddle Equation"]
[]
["1.1.   The Blaney-Criddle equation in its basic form is"]
[]
[]
[]
[]
[]
[]
[]
["where:"]
[]
[null,"U","=  crop evapotranspiration for A given period"]
[]
[null,"k","=  an annual, seasonal, or monthly empirical consumptive use coefficient which varies according to the crop"]
[null,null," (see description below)"]
[]
[null,"p","= percent of daytime hours of the year which occur during the period"]
[]
[null,"t","= mean temperature for the period, In degrees Farenheit"]
[]
[null,"m","= month"]
[]
["1.2   The following modification has been made to the above equation:"]
[]
["(2)                   k = kt X kc"]
[]
["where:"]
[]
[null,"kt = a climatic coefficient which is related to the mean air temperature; kt = 0.0173t - 0.314"]
[]
[null,"kc = a coefficient reflecting the growth stage of the crop; values are shown in Tables SCR-1\" "]
[]
["2.0   The irrigation water use allocation is calculated as follows:"]
[]
[null,"(3)","SUP = U – RE (d, s) "]
[]
[null,"(4)","Q =  SUP X ACM X A"]
[]
["where:"]
[]
[null,"SUP = supplemental irrigation requirement for the growing period in inches"]
[null," "]
[null,"RE = effective rainfall, which is normalized to the design drought (d), and the soil type (s)"]
[]
[null,"Q = allocation (acre inches)"]
[]
[null,"ACM = Allocation Coefficient Multiplier (BOR Table 2-1)"]
[]
[null,"A = irrigated acreage (acres)"]
[]
["2.1   Growth Coefficients"]
[]
[null,"2.1.1  The crop growth coefficient used in the equations are determined as follows:"]
[]
[null,"1)","For perennial crops, twelve monthly coefficients are given in Table SCR-1."]
[]
[null,"2)","For annual crops, monthly coefficients for  growing seasons of three and four months are given in Table SCR-1. "]
[]
["2.2   Calculation of Monthly Supplemental Irrigation Requirement and Allocation"]
[]
["2.2.1","The Water Use Division uses a computer program to calculate the supplemental irrigation water "]
[null,"requirement used in determining an irrigation water use allocation. The program approximates"]
[null," equations 1) and (2) as follows:"]
[]
[null,"(5)","F(M) =  (T(M) x P(M))  / 100"]
[]
[null,"(6)","AKT(M) =  (0.0173 x T(M)) - 0.314"]
[]
[null,"(7)","AKTF(M) = F(M ) X AKT(M)"]
[]
[null,"(8)","U(M)= AKTF(M) X AKC(M)"]
[]
[null,"(9)","RT1(M) = (0.70917 x (RT(M) 0.82416) - 0.11556)"]
[]
[null,"(10)","Ul(M)= 10  (0.02426 X U(M))"]
[]
[null,"(11)","F1 = 0.531747 + 0.295154 X D - 0.057697 X D 2 + 0.003804 X D 3"]
[]
[null,"(12)","RE(M) = RTI(M) X UI(M) X F1"]
[]
[null,"(13)","RE2 = RE(M) X F2"]
[]
["where:"," "]
[]
[null,"M = month of year"]
[]
[null,"U(M) = average monthly evapotranspiration "]
[]
["              ","RT(M) = average monthly rainfall (Table SCR-2) "]
[]
[null,"F(M) = monthly evapotranspiration factor "]
[]
[null,"T(M) = average monthly temperature (Table SCR-2 )"]
[]
[null,"P(M) = monthly percentage of annual daylight hours (Table SCR-2 )"]
[]
[null,"RE(M) = monthly effective rainfall"]
[]
[null,"RE2(M) = monthly effective rainfall normalized to level of certainty"]
[]
[null,"AKT(M) = kt"]
[]
[null,"AKC(M) = monthly crop growth coefficient (Table SCR-1)"]
[]
[null,"RT1(M) = average monthly effective rainfall factor considering average monthly rainfall"]
[]
[null,"Ul(M) = average monthly effective rainfall factor considering average monthly evapotranspiration "]
[]
[null,"D = net depth of application (see Figures SCR-1  through SCR-15)","= net depth of application (see Figures SCR-1  through SCR-15)"]
[]
[null,"F1 = soil factor"]
[]
[null,"F2 = ratio of design drought growing-season effective rainfall to average annual rainfall (Table SCR-2)"]
[]
[]
["The locations of the geographical areas represented by the rainfall stations (Table SCR-2) used to determine the average "]
["monthly rainfall RT(M), average monthly temperature T(M), and monthly percentage of annual daylight hours P(M)"]
["are shown in Figures SCR-1 through SCR-15."]
[]
["2.2.2            ","Equation (3) is solved for each month of the year for perennial crops, or for each month of the growing season"]
[null,"for annual crops.  The largest monthly difference between evapotranspiration and design drought effective rainfall"]
[" "," is the basis of the maximum month allocation and the total of the monthly differences between evapotranspiration"]
[null,"and design drought effective rainfall is the basis of the annual allocation.  The maximum month and annual differences "]
[null," are multiplied by the Allocation Coefficient Multiplier (BOR Table 2-1) to determine the overall crop requirement"]
[null,"then multiplied by the irrigated acreage to give an allocation, equation (4). "]
[]
["3.0   Additional information"]
[]
["Additional detail on this method may be found in \" Irrigation Water Requirements,\"  Technical Release No. 21, USDA, "]
["Soil Conservation Service, Engineering Division, 1970."]
[]
[]
[]
[]
[]
[]
[]
["TABLE SCR-1:  Growth Coefficients for Crops"]
[]
["Monthly Coefficiencts for Perennial Crops"]
[]
[null,"Jan","Feb","Mar","Apr","May","Jun","Jul","Aug","Sep","Oct","Nov","Dec"]
["AVOCADO","0.27","0.42","0.58","0.70","0.78","0.81","0.77","0.71","0.63","0.54","0.43","0.30"]
["CITRUS","0.63","0.66","0.68","0.70","0.71","0.71","0.71","0.71","0.70","0.68","0.67","0.64"]
["SUGARCANE","0.39","0.30","0.53","0.61","0.70","0.79","0.79","0.84","0.73","0.88","0.72","0.69"]
["GRAPES","0.20","0.24","0.38","0.60","0.71","0.80","0.80","0.76","0.61","0.50","0.35","0.23"]
["TURF GRASS","0.49","0.57","0.73","0.85","0.90","0.92","0.92","0.91","0.87","0.79","0.67","0.55"]
["PASTURE","0.46","0.60","0.63","0.68","0.70","0.53","0.56","0.58","0.52","0.53","0.49","0.44"]
[]
[]
["Monthly Coefficients for Annual Crops"]
[]
[null,null,"Three-Month Growing Season",null,null,null,null,"Four-Month "]
[null,null,null,null,null,null,null,"Growing Season"]
[]
[null,null,"Month of Growing Season",null,null,null,null,"Month of Growing "]
[null,null,null,null,null,null,null,"Season"]
[null,null,"1","2","3",null,null,"1","2","3","4"]
["DRY BEANS",null,"0.73","1.08","0.81",null,null,"0.66","1.02","1.06","0.75"]
["WINTER WHEAT",null,"0.40","0.81","1.18",null,null,"0.35","0.65","0.97","1.22"]
["SURGHUM ",null,"0.54","1.01","0.70",null,null,"0.43","0.99","0.93","0.65"]
["GREEN BEAN",null,"0.61","0.91","1.10",null,null,"0.58","0.79","1.01","1.11"]
["GRAIN CORN",null,"0.59","1.02","0.96",null,null,"0.54","0.90","1.06","0.93"]
["SILAGE CORN",null,"0.55","0.97","1.03",null,null,"0.51","0.81","1.06","1.02"]
["SWEET CORN",null,"0.60","1.02","1.04",null,null,"0.55","0.90","1.07","1.03"]
["MELONS",null,"0.56","0.79","0.72",null,null,"0.52","0.75","0.79","0.71"]
["PEAS",null,"0.72","1.09","1.03",null,null,"0.66","1.01","1.11","1.01"]
["POTATO",null,"0.54","1.18","1.32",null,null,"0.46","0.96","1.33","1.30"]
["SOYBEANS",null,"0.33","0.77","0.84",null,null,"0.30","0.56","0.96","0.79"]
["TOMATO",null,"0.50","0.93","0.84",null,null,"0.47","0.76","1.00","0.80"]
["SMALL VEGETABLES",null,"0.54","0.81","0.62",null,null,"0.48","0.77","0.81","0.57"]
[]
[]
[]
[]
[]
[]
[]
[]
[]
[]
[]
[]
[]
[]
[]
[]
[]
[]
[]
[]
[]
["TABLE SCR-2:  Rainfall Stations"]
[]
["STATION: ARCHBOLD"]
[null,"Jan","Feb","Mar","Apr","May","Jun","Jul","Aug","Sep","Oct","Nov","Dec"]
["Mean Rainfall","1.91","2.20","3.11","2.33","4.27","7.80","6.94","7.15","6.80","3.24","1.63","1.64"]
["Mean Temperature (F)","60.61","61.97","66.39","70.40","75.65","79.37","80.42","80.94","79.60","74.37","68.40","62.65"]
["Annual Daylight (%)","7.43","7.09","8.38","8.66","9.42","9.35","9.54","9.15","8.32","8.04","7.31","7.31"]
[null,"Temperature based on 29 years of data, rainfall based on 68 years of data"]
[null,"Factor for conversion of average rainfall to drought rainfall = 0.83"]
[]
["STATION: AVON PARK"]
[null,"Jan","Feb","Mar","Apr","May","Jun","Jul","Aug","Sep","Oct","Nov","Dec"]
["Mean Rainfall","2.24","2.51","2.82","2.52","4.12","8.27","8.03","7.50","7.15","3.59","1.71","1.76"]
["Mean Temperature (F)","61.74","63.41","67.61","72.20","77.06","80.63","81.90","82.00","80.47","74.97","68.17","63.29"]
["Annual Daylight (%)","7.42","7.08","8.37","8.67","9.44","9.37","9.56","9.16","8.32","8.03","7.3","7.29"]
[null,"Temperature based on 67 years of data, rainfall based on 93 years of data"]
[null,"Factor for conversion of average rainfall to drought rainfall = 0.84"]
[]
["STATION: BELLE GLADE"]
[null,"Jan","Feb","Mar","Apr","May","Jun","Jul","Aug","Sep","Oct","Nov","Dec"]
["Mean Rainfall","2.20","1.89","3.02","2.85","4.85","8.65","7.81","7.95","7.98","4.34","2.22","1.72"]
["Mean Temperature (F)","63.00","63.83","67.55","70.60","75.29","78.93","80.32","80.68","79.43","74.94","68.87","64.32"]
["Annual Daylight (%)","7.46","7.11","8.38","8.65","9.4","9.32","9.52","9.13","8.32","8.05","7.33","7.34"]
[null,"Temperature based on 68 years of data, rainfall based on 72 years of data"]
[null,"Factor for conversion of average rainfall to drought rainfall = 0.84"]
[]
["STATION: CLEWISTON"]
[null,"Jan","Feb","Mar","Apr","May","Jun","Jul","Aug","Sep","Oct","Nov","Dec"]
["Mean Rainfall","2.08","1.98","2.37","2.39","4.27","7.20","6.28","6.38","5.92","3.46","1.93","1.67"]
["Mean Temperature (F)","63.52","65.00","69.10","73.20","77.29","80.43","81.84","82.00","81.17","76.58","70.57","65.26"]
["Annual Daylight (%)","7.45","7.1","8.38","8.66","9.4","9.33","9.52","9.13","8.32","8.04","7.33","7.33"]
[null,"Temperature based on 50 years of data, rainfall based on 46 years of data"]
[null,"Factor for conversion of average rainfall to drought rainfall = 0.83"]
[]
["STATION: EVERGLADES"]
[null,"Jan","Feb","Mar","Apr","May","Jun","Jul","Aug","Sep","Oct","Nov","Dec"]
["Mean Rainfall","1.69","1.63","0.95","2.26","4.41","9.75","8.21","7.79","9.07","4.12","1.46","1.45"]
["Mean Temperature (F)","65.10","66.03","69.39","73.17","76.94","80.30","81.77","82.00","81.50","77.29","71.23","66.74"]
["Annual Daylight (%)","7.49","7.12","8.38","8.64","9.37","9.29","9.49","9.11","8.32","8.06","7.36","7.37"]
[null,"Temperature based on 67 years of data, rainfall based on 57 years of data"]
[null,"Factor for conversion of average rainfall to drought rainfall = 0.83"]
[]
["STATION: FORT DRUM"]
[null,"Jan","Feb","Mar","Apr","May","Jun","Jul","Aug","Sep","Oct","Nov","Dec"]
["Mean Rainfall","2.05","2.72","3.39","2.16","4.67","7.52","7.46","6.80","6.48","3.92","1.79","1.78"]
["Mean Temperature (F)","61.77","62.90","66.84","70.77","75.48","79.23","81.00","81.00","79.63","74.61","68.57","63.00"]
["Annual Daylight (%)","7.41","7.08","8.37","8.67","9.44","9.37","9.56","9.16","8.32","8.03","7.29","7.29"]
[null,"Temperature based on 50 years of data, rainfall based on 50 years of data"]
[null,"Factor for conversion of average rainfall to drought rainfall = 0.85"]
[]
[]
[]
[]
[]
[]
["TABLE SCR-2:  Rainfall Stations"]
[]
["STATION: FT. LAUDERDALE"]
[null,"Jan","Feb","Mar","Apr","May","Jun","Jul","Aug","Sep","Oct","Nov","Dec"]
["Mean Rainfall","2.86","2.52","2.90","4.12","6.28","9.02","6.39","6.90","8.21","8.40","3.96","2.52"]
["Mean Temperature (F)","66.81","67.62","70.71","74.27","77.94","80.90","82.00","82.26","81.37","77.77","72.63","68.42"]
["Annual Daylight (%)","7.49","7.12","8.38","8.64","9.37","9.29","9.49","9.11","8.32","8.06","7.36","7.37"]
[null,"Temperature based on 50 years of data, rainfall based on 83 years of data"]
[null,"Factor for conversion of average rainfall to drought rainfall = 0.82"]
[]
["STATION: FT. MYERS"]
[null,"Jan","Feb","Mar","Apr","May","Jun","Jul","Aug","Sep","Oct","Nov","Dec"]
["Mean Rainfall","1.90","2.00","1.50","1.90","4.10","9.40","8.70","8.60","8.40","3.50","1.50","1.50"]
["Mean Temperature (F)","64.03","65.10","68.87","73.13","77.97","81.23","82.53","82.90","81.60","76.58","69.83","65.29"]
["Annual Daylight (%)","7.46","7.11","8.38","8.65","9.4","9.32","9.52","9.13","8.32","8.05","7.33","7.34"]
[null,"Temperature based on 50 years of data, rainfall based on 57 years of data"]
[null,"Factor for conversion of average rainfall to drought rainfall = 0.84"]
[]
["STATION: FT. PIERCE"]
[null,"Jan","Feb","Mar","Apr","May","Jun","Jul","Aug","Sep","Oct","Nov","Dec"]
["Mean Rainfall","2.48","2.77","3.23","3.08","4.29","5.98","5.66","5.82","8.03","6.72","2.95","2.07"]
["Mean Temperature (F)","63.29","64.31","67.94","72.00","76.42","79.77","81.00","81.35","80.30","75.97","69.80","64.94"]
["Annual Daylight (%)","7.42","7.09","8.38","8.66","9.43","9.36","9.55","9.15","8.32","8.03","7.3","7.3"]
[null,"Temperature based on 67 years of data, rainfall based on 96 years of data"]
[null,"Factor for conversion of average rainfall to drought rainfall = 0.83"]
[]
["STATION: HIALEAH"]
[null,"Jan","Feb","Mar","Apr","May","Jun","Jul","Aug","Sep","Oct","Nov","Dec"]
["Mean Rainfall","2.28","2.11","2.70","3.70","6.37","9.31","7.07","8.25","8.98","7.39","3.52","1.85"]
["Mean Temperature (F)","66.42","67.55","71.03","74.30","77.97","80.80","82.00","82.16","81.30","77.39","72.20","67.77"]
["Annual Daylight (%)","7.49","7.12","8.38","8.64","9.37","9.29","9.49","9.11","8.32","8.06","7.36","7.37"]
[null,"Temperature based on 50 years of data, rainfall based on 56 years of data"]
[null,"Factor for conversion of average rainfall to drought rainfall = 0.81"]
[]
["STATION: HOMESTEAD"]
[null,"Jan","Feb","Mar","Apr","May","Jun","Jul","Aug","Sep","Oct","Nov","Dec"]
["Mean Rainfall","1.72","1.86","2.29","3.18","6.73","9.39","7.95","8.27","10.27","7.18","2.15","1.35"]
["Mean Temperature (F)","65.77","67.45","69.81","72.50","76.52","80.03","81.45","82.00","81.07","77.45","71.93","67.29"]
["Annual Daylight (%)","7.52","7.13","8.39","8.63","9.35","9.26","9.47","9.09","8.31","8.07","7.38","7.4"]
[null,"Temperature based on 72 years of data, rainfall based on 72 years of data"]
[null,"Factor for conversion of average rainfall to drought rainfall = 0.84"]
[]
["STATION: HYPOLUXO"]
[null,"Jan","Feb","Mar","Apr","May","Jun","Jul","Aug","Sep","Oct","Nov","Dec"]
["Mean Rainfall","3.10","2.73","3.46","3.45","5.26","8.29","5.75","6.57","7.78","7.73","3.81","2.61"]
["Mean Temperature (F)","65.84","66.69","70.10","73.63","77.81","80.77","82.29","82.55","81.30","77.45","71.87","67.35"]
["Annual Daylight (%)","7.46","7.11","8.38","8.65","9.4","9.32","9.52","9.13","8.32","8.05","7.33","7.34"]
[null,"Temperature and rainfall based on 97 years of data"]
[null,"Factor for conversion of average rainfall to drought rainfall = 0.81"]
[]
[]
[]
[]
[]
[]
["TABLE SCR-2:  Rainfall Stations"]
[]
["STATION: IMMOKALEE"]
[null,"Jan","Feb","Mar","Apr","May","Jun","Jul","Aug","Sep","Oct","Nov","Dec"]
["Mean Rainfall","2.14","2.26","3.09","2.23","4.23","8.61","7.48","7.35","6.71","2.90","1.95","1.51"]
["Mean Temperature (F)","64.03","65.24","68.77","71.87","76.74","80.10","81.26","81.74","80.67","76.00","67.20","65.45"]
["Annual Daylight (%)","7.48","7.12","8.38","8.64","9.38","9.30","9.50","9.12","9.32","8.06","7.35","7.36"]
[null,"Temperature based on 28 years of data, rainfall based on 37 years of data"]
[null,"Factor for conversion of average rainfall to drought rainfall = 0.82"]
["STATION: JUPITER"]
[null,"Jan","Feb","Mar","Apr","May","Jun","Jul","Aug","Sep","Oct","Nov","Dec"]
["Mean Rainfall","3.41","2.94","4.27","3.07","5.55","7.59","5.41","6.78","8.44","8.42","3.61","2.47"]
["Mean Temperature (F)","64.84","65.69","69.26","72.97","76.97","80.17","81.68","82.06","81.20","76.90","71.10","66.61"]
["Annual Daylight (%)","7.44","7.1","8.38","8.66","9.41","9.34","9.53","9.14","8.32","8.04","7.32","7.32"]
[null,"Temperature based on 50 years of data, rainfall based on 97 years of data"]
[null,"Factor for conversion of average rainfall to drought rainfall = 0.81"]
[]
["STATION: KISSIMMEE"]
[null,"Jan","Feb","Mar","Apr","May","Jun","Jul","Aug","Sep","Oct","Nov","Dec"]
["Mean Rainfall","2.12","2.67","3.31","2.49","3.90","6.97","7.46","6.76","6.49","3.27","1.96","2.08"]
["Mean Temperature (F)","60.94","62.38","66.65","71.20","76.19","80.30","81.65","81.84","80.07","74.77","67.93","62.48"]
["Annual Daylight (%)","7.39","7.06","8.37","8.68","9.47","9.4","9.59","9.18","8.32","8.01","7.27","7.26"]
[null,"Temperature based on 50 years of data, rainfall based on 94 years of data"]
[null,"Factor for conversion of average rainfall to drought rainfall = 0.83"]
[]
["STATION: LA BELLE"]
[null,"Jan","Feb","Mar","Apr","May","Jun","Jul","Aug","Sep","Oct","Nov","Dec"]
["Mean Rainfall","1.95","2.11","2.02","2.54","4.57","9.38","8.19","7.85","6.82","3.80","1.73","1.72"]
["Mean Temperature (F)","62.94","64.62","68.23","72.27","77.10","80.33","81.16","81.77","80.43","75.42","68.97","64.65"]
["Annual Daylight (%)","7.45","7.1","8.38","8.66","9.4","9.33","9.52","9.13","8.32","8.04","7.33","7.33"]
[null,"Temperature and rainfall based on 57 years of data"]
[null,"Factor for conversion of average rainfall to drought rainfall = 0.86"]
[]
["STATION: LOXAHATCHEE"]
[null,"Jan","Feb","Mar","Apr","May","Jun","Jul","Aug","Sep","Oct","Nov","Dec"]
["Mean Rainfall","2.59","2.38","3.33","2.99","5.52","8.95","7.94","7.32","9.71","6.44","3.18","2.21"]
["Mean Temperature (F)","63.00","63.83","67.55","70.60","75.29","78.93","80.32","80.68","79.43","74.94","68.87","64.32"]
["Annual Daylight (%)","7.46","7.11","8.38","8.65","9.4","9.32","9.52","9.13","8.32","8.05","7.33","7.34"]
[null,"Temperature based on 68 years of data, rainfall based on 47 years of data"]
[null,"Factor for conversion of average rainfall to drought rainfall = 0.83"]
[]
["STATION: MIAMI"]
[null,"Jan","Feb","Mar","Apr","May","Jun","Jul","Aug","Sep","Oct","Nov","Dec"]
["Mean Rainfall","2.02","2.06","2.08","3.13","6.35","7.84","5.44","6.29","8.30","8.38","2.80","2.05"]
["Mean Temperature (F)","67.35","68.48","71.65","75.13","78.74","81.23","82.68","82.84","81.67","78.10","73.13","68.87"]
["Annual Daylight (%)","7.5","7.13","8.38","8.63","9.36","9.28","9.48","9.13","8.32","8.07","7.37","7.38"]
[null,"Temperature based on 50 years of data, rainfall based on 79 years of data"]
[null,"Factor for conversion of average rainfall to drought rainfall = 0.78"]
[]
[]
[]
[]
[]
[]
[]
["TABLE SCR-2:  Rainfall Stations"]
[]
["STATION: MOORE HAVEN"]
[null,"Jan","Feb","Mar","Apr","May","Jun","Jul","Aug","Sep","Oct","Nov","Dec"]
["Mean Rainfall","1.82","2.04","1.90","2.38","4.33","7.57","7.04","6.73","6.97","3.47","1.73","1.62"]
["Mean Temperature (F)","62.71","63.86","67.81","71.87","76.48","80.00","81.32","81.71","80.50","75.61","69.00","64.26"]
["Annual Daylight (%)","7.44","7.1","8.38","8.66","9.41","9.34","9.53","9.14","8.32","8.04","7.32","7.32"]
[null,"Temperature based on 67 years of data, rainfall based on 58 years of data"]
[null,"Factor for conversion of average rainfall to drought rainfall = 0.83"]
[]
["STATION: NAPLES"]
[null,"Jan","Feb","Mar","Apr","May","Jun","Jul","Aug","Sep","Oct","Nov","Dec"]
["Mean Rainfall","1.88","1.93","0.96","2.05","4.42","8.17","8.36","8.18","8.69","4.09","1.56","1.32"]
["Mean Temperature (F)","64.97","65.93","69.39","73.00","77.26","80.57","81.87","82.00","81.53","77.03","71.20","66.55"]
["Annual Daylight (%)","7.49","7.12","8.38","8.64","9.37","9.29","9.49","9.11","8.32","8.06","7.36","7.37"]
[null,"Temperature based on 50 years of data, rainfall based on 55 years of data"]
[null,"Factor for conversion of average rainfall to drought rainfall = 0.83"]
[]
["STATION: OKEECHOBEE"]
[null,"Jan","Feb","Mar","Apr","May","Jun","Jul","Aug","Sep","Oct","Nov","Dec"]
["Mean Rainfall","1.76","2.19","2.89","2.78","4.29","7.35","6.55","6.65","6.37","4.10","1.91","1.58"]
["Mean Temperature (F)","62.03","63.93","67.84","72.13","76.81","80.17","81.61","81.71","80.47","75.35","69.13","63.65"]
["Annual Daylight (%)","7.43","7.09","8.38","8.66","9.42","9.35","9.54","9.15","8.32","8.04","7.31","7.31"]
[null,"Temperature based on 50 years of data, rainfall based on 73 years of data"]
[null,"Factor for conversion of average rainfall to drought rainfall = 0.82"]
[]
["STATION: POMPANO BEACH"]
[null,"Jan","Feb","Mar","Apr","May","Jun","Jul","Aug","Sep","Oct","Nov","Dec"]
["Mean Rainfall","2.94","3.60","5.98","7.75","6.41","6.73","7.99","7.71","3.60","2.30","2.71","2.14"]
["Mean Temperature (F)","66.90","67.55","70.77","74.30","77.68","80.53","82.03","82.42","81.10","77.39","72.40","68.03"]
["Annual Daylight (%)","7.48","7.12","8.38","8.64","9.38","9.3","9.5","9.12","8.32","8.06","7.35","7.36"]
[null,"Temperature based on 50 years of data, rainfall based on 55 years of data"]
[null,"Factor for conversion of average rainfall to drought rainfall = 0.82"]
[]
["STATION: STUART"]
[null,"Jan","Feb","Mar","Apr","May","Jun","Jul","Aug","Sep","Oct","Nov","Dec"]
["Mean Rainfall","2.40","2.72","3.57","2.76","4.95","6.58","6.53","5.71","8.05","6.69","2.83","2.56"]
["Mean Temperature (F)","64.84","65.69","69.26","72.97","76.97","80.17","81.68","82.06","81.20","76.90","71.10","66.61"]
["Annual Daylight (%)","7.44","7.1","8.38","8.66","9.42","9.35","9.54","9.14","8.32","8.04","7.32","7.31"]
[null,"Temperature based on 50 years of data, rainfall based on 60 years of data"]
[null,"Factor for conversion of average rainfall to drought rainfall = 0.81"]
[]
["STATION: S-65"]
[null,"Jan","Feb","Mar","Apr","May","Jun","Jul","Aug","Sep","Oct","Nov","Dec"]
["Mean Rainfall","2.18","2.91","3.05","2.20","4.39","7.90","7.70","6.58","6.30","3.30","2.14","1.84"]
["Mean Temperature (F)","61.03","62.72","67.00","71.60","76.77","80.23","81.16","81.48","79.97","74.10","67.17","62.16"]
["Annual Daylight (%)","7.41","7.08","8.37","8.67","9.44","9.37","9.56","9.16","8.32","8.03","7.29","7.29"]
[null,"Temperature based on 50 years of data, rainfall based on 30 years of data"]
[null,"Factor for conversion of average rainfall to drought rainfall = 0.85"]
[]
[]
[]
[]
[]
[]
["TABLE SCR-2:  Rainfall Stations"]
[]
["STATION: S 140 W"]
[null,"Jan","Feb","Mar","Apr","May","Jun","Jul","Aug","Sep","Oct","Nov","Dec"]
["Mean Rainfall","2.03","1.67","2.36","2.33","4.27","8.38","5.72","6.71","5.48","2.47","1.93","1.38"]
["Mean Temperature (F)","66.71","68.34","70.45","73.73","78.16","82.07","83.90","84.00","83.37","79.23","74.00","68.65"]
["Annual Daylight (%)","7.50","7.12","8.38","8.64","9.36","9.28","9.48","9.13","8.32","8.06","7.37","7.38"]
[null,"Temperature based on 20 years of data, rainfall based on 23 years of data"]
[null,"Factor for conversion of average rainfall to drought rainfall = 0.83"]
[]
["STATION: TAMIAMI 4"]
[null,"Jan","Feb","Mar","Apr","May","Jun","Jul","Aug","Sep","Oct","Nov","Dec"]
["Mean Rainfall","1.67","1.56","1.99","2.73","5.44","9.35","8.06","7.26","8.20","4.72","2.02","1.19"]
["Mean Temperature (F)","66.94","67.72","70.65","73.53","77.48","80.93","82.77","83.06","82.23","78.55","73.00","68.23"]
["Annual Daylight (%)","7.5","7.12","8.38","8.64","9.36","9.28","9.48","9.13","8.32","8.06","7.37","7.38"]
[null,"Temperature based on 50 years of data, rainfall based on 56 years of data"]
[null,"Factor for conversion of average rainfall to drought rainfall = 0.83"]
[]
["STATION: WEST PALM BEACH"]
[null,"Jan","Feb","Mar","Apr","May","Jun","Jul","Aug","Sep","Oct","Nov","Dec"]
["Mean Rainfall","2.77","2.54","3.38","3.52","5.65","7.97","6.32","6.73","8.81","6.86","3.90","2.52"]
["Mean Temperature (F)","65.84","66.69","70.10","73.63","77.81","80.77","82.29","82.55","81.30","77.45","71.87","67.35"]
["Annual Daylight (%)","7.47","7.11","8.38","8.65","9.39","9.32","9.51","9.12","8.32","8.05","7.34","7.34"]
[null,"Temperature based on 50 years of data, rainfall based on 58 years of data"]
[null,"Factor for conversion of average rainfall to drought rainfall = 0.80"]

{"sheet":"Update Info","index":2,"n_rows":20,"n_cols":1,"rows_kept":20,"cut":false,"hidden":false,"merged":[]}
[]
[]
["Revisions to Spreadsheet"]
["2014-01-01"]
["This revised Excel program for the Modified Blaney-Criddle equation was designed with a Macro button in order to allow the summation of multiple supplemental irrigation crop demands. The summation results are outputted into a new “Exhibit Totals” sheet.  The “Exhibit” sheet is similar to the previous spreadsheet versions and should be used to print the results of each crop. This Exhibit has been updated to include planting information for annual crops, crop numbering for single and multiple planting within a parcel, parcel naming, and exhibit labeling.  The “Input2” sheet has been revised to include inputs for the total number of parcels, parcel names, the number of multiple planting within a single parcel, and the  exhibit numbering for both the “Exhibit” and “Exhibit Totals” sheets. In addition, a quick view calculation screen, an error notifying cell, a crop input button and a counter for the total number of crop parcels processed and multiple crops in a parcel processed. This revised spreadsheet also includes additional annual growing season lengths (1 to 12 months) and updated significant digit formatting of calculated output."]
["2014-02-01"]
["Four additional crops types were added (strawberries, peppers, sorghum, hay) to the existing annual crops (seasonal), a salt flush allocation option was included for citrus crops using micro-irrigation systems and added an irrigation system efficiency for flood/seepage systems in the Everglades Agricultural Area (E.A.A) ."]
["Macro Instruction:"]
["If the macro button does not work, you may need to change the existing setting in Excel. The following are brief instructions on how to active the use of macros within Excel:"]
["Go to the file tab in Excel and select options. Within the options window, select customize ribbon.  Within the right column, select at the top main tabs and click to turn on the developer tab down below. Click OK in the lower right corner.  Next, click on the Developer tab and in the upper left corner, click on Macro Security.  Within Macro Settings, select disable all macros with notification.  Re-enter the spreadsheet and select allow macro.  Hopefully, this will now allow the macro to function."]
[]
[]
[]
["Instructions for Operation"]
[]
["If the Project consists of different crops, these crops should be divided into separate parcels or fields. The spreadsheet currently allows the inputting of 20 different crops and the results are displayed on the “Exhibit Totals” sheet. On the “Input2” sheet, the total number of multiple parcels or fields within the Project should be inputted in (Row 2, Col P) first and not changed again until all parcels have been processed. Therefore, it is very important to enter the correct number of parcels or fields. The inputting of each crop is accomplished by clicking on the Input Crop macro button located in the lower right section on the “Input2” sheet. When calculating only one crop, the summarized results are shown in the “Exhibit” sheet and there is no need to use the Input Crop macro button on the “Input2” sheet. DO NOT DIRECTLY INPUT ANY INFORMATION ON THE “Exhibit” OR “Exhibit Totals” SHEETS. Remember to always print the “Exhibit” sheet prior to inputting the crop with the Input Crop macro button. The spreadsheet should identify most ERRORS and display the problem to be corrected. The specific number of crop parcels being processed is shown in (Row 6, Col J). When all parcels or fields have been completed, the adjacent cell will display “TOTAL CROP PARCELS COMPLETED” (Row 6, Col K). Print the “Exhibit Totals” sheet at this time."]
[]
["Multiple Annual Plantings within one Parcel"]
[]
["The spreadsheet currently allows up to 5 crops being planted within one parcel. Remember, there can be no overlapping of plantings and no more than 12 months can be planted within one parcel. The typical growing season length for most annual crops is 90 to 120 days or 3 to 4 months. If the Project has multiple annual plantings within one parcel or field, consisting of different annual crops, prior to inputting the crop information for that parcel or field with the Input Crop macro button, remember to enter of the total number of the multiple plantings for that parcel (Row 4, Col P). This should only be used when there are multiple crop plantings on one parcel or field, otherwise, annuals should be inputted as separate crops on different parcels (discussed above).  The count number of multiple plantings within one parcel is displayed in (Row 7, Col J).  After the processing of that parcel has been completed, the adjacent cell will display “MULTIPLE CROPS IN THE PARCEL COMPLETED” (Row 7, Col K). Remember to change the number of multiple plantings within one parcel back to either 1 or “” or the number of multiple crop plantings within the next parcel."]

{"sheet":"Input2","index":3,"n_rows":75,"n_cols":20,"rows_kept":75,"cut":false,"hidden":false,"merged":[[13,4,13,5],[13,6,13,7],[6,2,6,7],[4,9,4,14],[3,9,3,14],[5,10,5,15],[9,2,9,7],[6,10,6,15],[7,9,8,12],[7,13,8,15],[10,9,10,12],[10,13,10,15],[9,13,9,15],[9,9,9,12],[1,15,2,15],[3,15,4,15],[3,2,3,7],[1,2,1,7],[2,2,2,7],[2,9,2,14],[1,9,1,14],[21,9,21,15],[20,2,21,7],[15,2,15,7],[14,2,14,7],[10,2,10,7],[12,9,12,15],[11,2,11,7],[12,2,12,7],[13,9,13,15],[11,9,11,15],[19,2,19,7],[16,2,16,7],[17,2,17,7],[18,2,18,7],[14,9,14,15],[13,2,13,3]]}
[null,null,"Drop Down Menus"]
[null,"Rainfall Event","1-in-10",null,null,null,null,null,null,"Total number of crop parcels (Fields)      Must be > = 1",null,null,null,null,null,1]
[null,"Rainfall Station Name","Okeechobee     1-in-10",null,null,null,null,null,null,"DO NOT CHANGE WHILE \"TOTAL CROPS PARCELS\" IS PROCESSING"]
[null,"Crop Type","Perennial-Nursery",null,null,null,null,null,null,"How many different annual crops will be planted on this parcel?         (If there are no annuals being re-planted in the same area, Input = 1)",null,null,null,null,null,1]
[null,"Check each month crop is being planted (Multiple plantings of same crop)",null,null,null,null,null,null,null,"DO NOT CHANGE WHILE \"MULTIPLE CROPS IN PARCEL\" IS PROCESSING"]
[null,"(Only Needed For Annual Crops)",null,null,null,null,null,null,null,0,"TOTAL CROP PARCELS COMPLETED"]
[null,"Required time from planting to last harvest of same planted crop","4 months",null,null,null,null,null,null,0,"MULTIPLE CROPS IN PARCEL COMPLETED"]
[null,"(Growing season length of crop type)",null,null,null,null,null,null,null,"Parcel Name"]
[null,"(Only Needed For Annual Crops)"]
[null,"Soil Type",0.8,null,null,null,null,null,null,"Exhibit Number on \"Exhibit\" Sheet"]
[null,"Irrigation System","Drip",null,null,null,null,null,null,"Exhibit Number on \"Exhibit Totals\" Sheet"]
[null,"SWM Permit","Yes",null,null,null,null,null,null,"MONTHS PLANTED FOR MULTIPLE CROPS IN SINGLE PARCEL"]
[null,"Irrigated Acreage",1,null,null,null,null,null,null,{"$f":"'crop k''s'!A191","v":"                                    "}]
[null,"Salt Flush for Micro-irrigated Citrus?                 (Yes or No Drop Down)","No",null,"Salt Flush Depth (Inches, Citrus = 1)",null,1,null,null,"PRINT \"EXHIBIT\" PRIOR TO INPUTTING (SEE \"EXHIBIT\" SHEET)"]
[null,{"$f":"'crop k''s'!S63","v":""},"QUICK VIEW OF SUPPLEMENTAL CROP REQUIREMENTS",null,null,null,null,null,null,"REMEMBER TO INPUT CROP AFTER PRINTING \"EXHIBIT\""]
[null,{"$f":"IF(AND(InputControl!$B$57>50,'crop k''s'!S67<>\"\"),'crop k''s'!S67,\"\")","v":""},{"$f":"CONCATENATE(IF(InputControl!$B$12=2,\"2-in-10 Annual = \",\"1-in-10 Annual= \"),Exhibit!O25,\" inches\")","v":"1-in-10 Annual= 36.85 inches"}]
[null,{"$f":"IF(InputControl!$B$57>50,'crop k''s'!S64,'crop k''s'!S65)","v":"CALCULATION GOOD"},{"$f":"CONCATENATE(\"1 -in-10 Annual = \",'Blaney Calc'!G31,\" \",'Blaney Calc'!G32)","v":"1 -in-10 Annual = 1.18  MG"}]
[null,{"$f":"'crop k''s'!S69","v":""},{"$f":"CONCATENATE(\"1-in-10 Annual Average Daily =  \",IF('Blaney Calc'!K19<100000,'Blaney Calc'!K19,'Blaney Calc'!K20),\" \",IF('Blaney Calc'!K19<100000,'Blaney Calc'!L19,'Blaney Calc'!L20) )","v":"1-in-10 Annual Average Daily =  3234.42 GPD"}]
[null,{"$f":"'crop k''s'!S70","v":""},{"$f":"CONCATENATE(IF(InputControl!$B$12=2,\"2-in-10 Maximum Monthly = \",\"1-in-10 Maximum Monthly = \"),IF((InputControl!$B$57=13)*AND(InputControl!$A$160<>0),InputControl!A160,MAX(,Exhibit!C25:N25)),\" inches\")","v":"1-in-10 Maximum Monthly = 4.86 inches"},null,null,null,null,null,null,null,null,null,null,null,","]
[null,{"$f":"'crop k''s'!S71","v":""},{"$f":"CONCATENATE(\"1-in-10 Maximum Month = \",'Blaney Calc'!G33,\" \",'Blaney Calc'!G34)","v":"1-in-10 Maximum Month = 156,000  gallons"}]
[null,{"$f":"'crop k''s'!S72","v":""},{"$f":"'crop k''s'!C165","v":"1-in-10 Annual Average Day < 10,000 Gallons"}]
[]
[]
[]
[]
[]
[]
[]
[]
[]
[]
[]
[]
[]
[]
[]
[]
[]
[]
[]
[]
[]
[]
[]
[]
[]
[]
[]
[]
[]
[]
[]
[]
[]
[]
[]
[]
[]
[]
[]
[]
[]
[]
[]
[]
[]
[]
[]
[]
[]
[]
[]
[]
[]
[null,null,null,null,null,null,null,null,null,null,null,null,null,null,null,null,null,null,null,"TOTAL NUMBER OF CROP PARCELS NEED TO BE > 1 AND < 20"]

{"sheet":"Exhibit","index":4,"n_rows":56,"n_cols":15,"rows_kept":56,"cut":false,"hidden":false,"merged":[[2,1,2,11],[3,13,3,14],[2,12,2,13],[7,2,7,3],[55,13,55,15],[5,8,5,9],[6,8,6,9],[6,10,6,15],[7,7,7,9]]}
[]
[]
[null,"Calculations of Irrigation Requirements",null,null,null,null,null,null,null,null,null,null,{"$f":"IF(InputControl!$B$12=2,\"(2-in-10)\",\"(1-in-10)\")","v":"(1-in-10)"}]
[null,null,null,null,null,null,null,null,null,null,null,null,null," "]
[]
[null,"Rainfall Station:",{"$f":"Input2!C3","v":"Okeechobee     1-in-10"},null,null,null,null,null,"Crop No.:",null,1,null,null,null,1]
[null,"Irrigation System:",{"$f":"IF(InputControl!$B$12=2,VLOOKUP(InputControl!B89,'Irr System'!$A$3:$E$24,3,FALSE),VLOOKUP(InputControl!B89,'Irr System'!$A$28:$E$49,3,FALSE))","v":"Drip"},null,null,null,null,null,"Parcel Name:",null,{"$f":"IF(Input2!N8<>\"\",Input2!N8, \"\")","v":""}]
[null,"Irrigated Acreage:",{"$f":"Input2!C13","v":1},null,null,null,null,"Crop No. in Parcel:",null,null,1]
[null,"Crop:",{"$f":"IF(InputControl!$B$57<50,VLOOKUP(\"b\",'crop k''s'!$A$2:$Q$3,'crop k''s'!$D$104,FALSE),VLOOKUP(\"b\",'crop k''s'!$A$18:$U$19,'crop k''s'!$D$104,FALSE))","v":"Nursery"}]
[null,"Soil Type:",{"$f":"InputControl!$B$127","v":0.8}]
[null,"Multiplier",{"$f":"IF(InputControl!$B$12=2,IF(Input2!$C$12=\"YES\",VLOOKUP(InputControl!B89,'Irr System'!$A$3:$E$24,4,FALSE),VLOOKUP(InputControl!B89,'Irr System'!$A$3:$E$24,5,FALSE)),IF(Input2!$C$12=\"YES\",VLOOKUP(InputControl!B89,'Irr System'!$A$28:$E$49,4,FALSE),VLOOKUP(InputControl!B89,'Irr System'!$A$28:$E$49,5,FALSE)))","v":1.18}]
[null,"Efficiency",{"$f":"1/C11","v":0.85}]
[]
[null,{"$f":"IF(InputControl!$B$57>50,'crop k''s'!G144,\"\")","v":""}]
[]
[null,{"$f":"IF(InputControl!$B$57>50,'crop k''s'!G146,\"\")","v":""},{"$f":"IF(InputControl!$B$57>50,'crop k''s'!G147,\"\")","v":""}]
[]
[null,{"$f":"IF(InputControl!$B$57>50,'crop k''s'!G145,\"\")","v":""},null,{"$f":"IF(InputControl!$B$57>50,'crop k''s'!G148,\"\")","v":""}]
[null,"Calculations","Jan","Feb","Mar","Apr","May","Jun","Jul","Aug","Sep","Oct","Nov","Dec","Total"]
[null,"Average Rainfall (inches)",{"$f":"'Blaney Calc'!$A$4","v":1.76},{"$f":"'Blaney Calc'!$A$5","v":2.19},{"$f":"'Blaney Calc'!$A$6","v":2.89},{"$f":"'Blaney Calc'!$A$7","v":2.78},{"$f":"'Blaney Calc'!$A$8","v":4.29},{"$f":"'Blaney Calc'!$A$9","v":7.35},{"$f":"'Blaney Calc'!$A$10","v":6.55},{"$f":"'Blaney Calc'!$A$11","v":6.65},{"$f":"'Blaney Calc'!$A$12","v":6.37},{"$f":"'Blaney Calc'!$A$13","v":4.0999999999999996},{"$f":"'Blaney Calc'!$A$14","v":1.91},{"$f":"'Blaney Calc'!$A$15","v":1.58},{"$f":"SUM(C20:N20)","v":48.42}]
[null,"Evapotranspiration (inches)",{"$f":"ROUND('Blaney Calc'!$J$4,2)","v":1.71},{"$f":"ROUND('Blaney Calc'!$J$5,2)","v":2.0499999999999998},{"$f":"ROUND('Blaney Calc'!$J$6,2)","v":3.57},{"$f":"ROUND('Blaney Calc'!$J$7,2)","v":4.96},{"$f":"ROUND('Blaney Calc'!$J$8,2)","v":6.61},{"$f":"ROUND('Blaney Calc'!$J$9,2)","v":7.4},{"$f":"ROUND('Blaney Calc'!$J$10,2)","v":7.86},{"$f":"ROUND('Blaney Calc'!$J$11,2)","v":7.48},{"$f":"ROUND('Blaney Calc'!$J$12,2)","v":6.28},{"$f":"ROUND('Blaney Calc'!$J$13,2)","v":4.74},{"$f":"ROUND('Blaney Calc'!$J$14,2)","v":2.99},{"$f":"ROUND('Blaney Calc'!$J$15,2)","v":2.0099999999999998},{"$f":"ROUND(SUM(C21:N21),2)","v":57.66}]
[null,"Average Effective Rainfall (inches)",{"$f":"IF((C21)=0,(0),ROUND('Blaney Calc'!$N$4,2))","v":0.82},{"$f":"IF((D21)=0,(0),ROUND('Blaney Calc'!$N$5,2))","v":1.02},{"$f":"IF((E21)=0,(0),ROUND('Blaney Calc'!$N$6,2))","v":1.42},{"$f":"IF((F21)=0,(0),ROUND('Blaney Calc'!$N$7,2))","v":1.48},{"$f":"IF((G21)=0,(0),ROUND('Blaney Calc'!$N$8,2))","v":2.37},{"$f":"IF((H21)=0,(0),ROUND('Blaney Calc'!$N$9,2))","v":3.94},{"$f":"IF((I21)=0,(0),ROUND('Blaney Calc'!$N$10,2))","v":3.66},{"$f":"IF((J21)=0,(0),ROUND('Blaney Calc'!$N$11,2))","v":3.63},{"$f":"IF((K21)=0,(0),ROUND('Blaney Calc'!$N$12,2))","v":3.28},{"$f":"IF((L21)=0,(0),ROUND('Blaney Calc'!$N$13,2))","v":2.06},{"$f":"IF((M21)=0,(0),ROUND('Blaney Calc'!$N$14,2))","v":0.95},{"$f":"IF((N21)=0,(0),ROUND('Blaney Calc'!$N$15,2))","v":0.75},{"$f":"ROUND(SUM(C22:N22),2)","v":25.38}]
[null,{"$f":"IF(InputControl!$B$12=2,\"2-in-10 Effective Rainfall (inches)\",\"1-in-10 Effective Rainfall (inches)\")","v":"1-in-10 Effective Rainfall (inches)"},{"$f":"IF((C21)=0,(0),ROUND('Blaney Calc'!$P$4,2))","v":0.67},{"$f":"IF((D21)=0,(0),ROUND('Blaney Calc'!$P$5,2))","v":0.83},{"$f":"IF((E21)=0,(0),ROUND('Blaney Calc'!$P$6,2))","v":1.1599999999999999},{"$f":"IF((F21)=0,(0),ROUND('Blaney Calc'!$P$7,2))","v":1.21},{"$f":"IF((G21)=0,(0),ROUND('Blaney Calc'!$P$8,2))","v":1.95},{"$f":"IF((H21)=0,(0),ROUND('Blaney Calc'!$P$9,2))","v":3.23},{"$f":"IF((I21)=0,(0),ROUND('Blaney Calc'!$P$10,2))","v":3},{"$f":"IF((J21)=0,(0),ROUND('Blaney Calc'!$P$11,2))","v":2.98},{"$f":"IF((K21)=0,(0),ROUND('Blaney Calc'!$P$12,2))","v":2.69},{"$f":"IF((L21)=0,(0),ROUND('Blaney Calc'!$P$13,2))","v":1.69},{"$f":"IF((M21)=0,(0),ROUND('Blaney Calc'!$P$14,2))","v":0.78},{"$f":"IF((N21)=0,(0),ROUND('Blaney Calc'!$P$15,2))","v":0.62},{"$f":"ROUND(SUM(C23:N23),2)","v":20.81}]
[null,"Average Irrigation (inches)",{"$f":"IF((C21-C22)>=0,(C21-C22),0)","v":0.89},{"$f":"IF((D21-D22)>=0,(D21-D22),0)","v":1.03},2.15,3.48,4.24,3.46,4.2,3.85,3,2.68,2.04,1.26,32.28]
[null,{"$f":"IF(InputControl!$B$12=2,\"2-in-10 Irrigation (inches)\",\"1-in-10 Irrigation (inches)\")","v":"1-in-10 Irrigation (inches)"},{"$f":"IF((C21-C23)>=0,(C21-C23),0)","v":1.04},{"$f":"IF((D21-D23)>=0,(D21-D23),0)","v":1.22},2.41,3.75,4.66,4.17,4.8600000000000003,4.5,3.59,3.05,2.21,1.39,36.85]
[]
[]
[]
[null,{"$f":"CONCATENATE(IF(InputControl!$B$12=2,\"2-in-10 Annual Supplemental Crop Requirement = \",\"1-in-10 Annual Supplemental Crop Requirement = \"),O25,\" inches\")","v":"1-in-10 Annual Supplemental Crop Requirement = 36.85 inches"}]
[]
[null,"Annual Supplemental Crop Water Use:"]
[]
[null,null,null,null,{"$f":"CONCATENATE(O25,\" inches X \",Input2!$C$13,\" Acres X \",IF(InputControl!$B$12=2,IF(Input2!$C$12=\"YES\",VLOOKUP(InputControl!B89,'Irr System'!$A$3:$E$24,4,FALSE),VLOOKUP(InputControl!B89,'Irr System'!$A$3:$E$24,5,FALSE)),IF(Input2!$C$12=\"YES\",VLOOKUP(InputControl!B89,'Irr System'!$A$28:$E$49,4,FALSE),VLOOKUP(InputControl!B89,'Irr System'!$A$28:$E$49,5,FALSE))),\" X 0.02715 MG/AC-IN = \",'Blaney Calc'!G31,'Blaney Calc'!G32)","v":"36.85 inches X 1 Acres X 1.18 X 0.02715 MG/AC-IN = 1.18 MG"}]
[]
[]
[null,{"$f":"CONCATENATE(IF(InputControl!$B$12=2,\"2-in-10 Maximum Monthly Supplemental Crop Requirement = \",\"1-in-10 Maximum Monthly Supplemental Crop Requirement = \"),IF((InputControl!$B$57=13)*AND(InputControl!$A$160<>0),InputControl!A160,MAX(C25:N25)),\" inches\")","v":"1-in-10 Maximum Monthly Supplemental Crop Requirement = 4.86 inches"}]
[]
[null,"Maximum Monthly Supplemental Crop Water Use:"]
[]
[null,null,null,null,{"$f":"CONCATENATE(IF((InputControl!$B$57=13)*AND(InputControl!$A$160<>0),InputControl!A160,MAX(C25:N25)),\" inches X \",Input2!$C$13,\" Acres X \",IF(InputControl!$B$12=2,IF(Input2!$C$12=\"YES\",VLOOKUP(InputControl!B89,'Irr System'!$A$3:$E$24,4,FALSE),VLOOKUP(InputControl!B89,'Irr System'!$A$3:$E$24,5,FALSE)),IF(Input2!$C$12=\"YES\",VLOOKUP(InputControl!B89,'Irr System'!$A$28:$E$49,4,FALSE),VLOOKUP(InputControl!B89,'Irr System'!$A$28:$E$49,5,FALSE))),\" X 0.02715 MG/AC-IN = \",'Blaney Calc'!G33,'Blaney Calc'!G34)","v":"4.86 inches X 1 Acres X 1.18 X 0.02715 MG/AC-IN = 156,000 gallons"}]
[]
[null,{"$f":" CONCATENATE(IF('Blaney Calc'!D20<>0,\"Salt Flush Demand:\",\"\"),IF('Blaney Calc'!D20<>0,\" Salt Flush Depth of \",\"\"),IF('Blaney Calc'!D20<>0,Input2!G14,\"\"),IF('Blaney Calc'!D20<>0,\" inches X \",\"\"),IF('Blaney Calc'!D20<>0,Input2!$C$13,\"\"),IF('Blaney Calc'!D20<>0,\" Acres = \",\"\"),IF('Blaney Calc'!D20<>0,'Blaney Calc'!E33,\"\"),IF('Blaney Calc'!D20<>0,'Blaney Calc'!E34,\"\"))","v":""}]
[]
[null,{"$f":"CONCATENATE(IF('Blaney Calc'!D20<>0,\"Maximum Monthly Supplemental Crop Water Use (Including Salt Flush): \",\"\"),IF('Blaney Calc'!D20<>0,'Blaney Calc'!H33,\"\"),IF('Blaney Calc'!D20<>0,'Blaney Calc'!H34,\"\"))","v":""}]
[]
[null,"Notes:"]
[null,"Evapotranspiration was calculated using a modified Blaney-Criddle method."]
[null,"Average effective rainfall is the amount that is useful to crops in an average year"]
[null,{"$f":"CONCATENATE(IF((InputControl!$B$12=1),\"Drought rainfall is the rainfall minimum representative of a 1-in-10 year\",\"2-in-10 drought rainfall is the rainfall minimum expected with a\"),\" drought\")","v":"Drought rainfall is the rainfall minimum representative of a 1-in-10 year drought"}]
[null,{"$f":"CONCATENATE(IF((InputControl!$B$12=1),\"Drought effective rainfall is the amount that is useful to crops in a\",\"2-in-10 effective rainfall is the amount that is useful to crops in a\"),IF((InputControl!$B$12=1),\" 1-in-10 year\",\"2-in-10\"))","v":"Drought effective rainfall is the amount that is useful to crops in a 1-in-10 year"}]
[null,{"$f":"IF((InputControl!$B$12=1),\"drought event.\",\"drought rainfall.\")","v":"drought event."}]
[null,"Average irrigation is the net amount that should be required for maximum yields during an"]
[null,"average year."]
[null,{"$f":"IF((InputControl!$B$12=1),\"Drought irrigation is the net amount that should be required for maximum yields during\",\"2-in-10 irrigation is the net amount that should be required for maximum yields during\")","v":"Drought irrigation is the net amount that should be required for maximum yields during"}]
[null,{"$f":"IF((InputControl!$B$12=1),\"a 1-in-10 year drought.\",\"a 2-in-10 drought year.\")","v":"a 1-in-10 year drought."}]
[null,null,null,null,null,null,null,null,null,null,null,null,null,{"$f":"CONCATENATE(\"EXHIBIT \",Input2!N10)","v":"EXHIBIT "}]

{"sheet":"Exhibit Totals","index":5,"n_rows":53,"n_cols":17,"rows_kept":53,"cut":false,"hidden":false,"merged":[[52,12,52,14],[47,12,47,13],[45,12,45,13],[49,12,49,13],[15,7,15,9],[45,10,45,11],[49,10,49,11],[41,12,41,13],[43,12,43,13],[19,7,19,9],[21,10,21,11],[21,12,21,13],[17,10,17,11],[17,12,17,13],[37,12,37,13],[11,2,11,6],[39,2,39,6],[39,7,39,9],[39,10,39,11],[39,12,39,13],[11,7,11,9],[25,10,25,11],[19,10,19,11],[21,2,21,6],[21,7,21,9],[11,10,11,11],[17,2,17,6],[17,7,17,9],[11,12,11,13],[15,2,15,6],[13,10,13,11],[2,14,2,15],[19,12,19,13],[4,7,4,9],[4,10,4,11],[7,10,7,11],[4,12,4,13],[9,7,9,9],[15,12,15,13],[13,7,13,9],[7,12,7,13],[9,10,9,11],[9,12,9,13],[7,7,7,9],[15,10,15,11],[51,2,51,6],[51,7,51,9],[47,2,47,6],[47,7,47,9],[47,10,47,11],[43,2,43,6],[43,7,43,9],[43,10,43,11],[49,2,49,6],[49,7,49,9],[45,2,45,6],[45,7,45,9],[41,2,41,6],[41,7,41,9],[41,10,41,11],[23,10,23,11],[25,7,25,9],[37,2,37,6],[37,7,37,9],[37,10,37,11],[13,2,13,6],[35,2,35,6],[35,7,35,9],[35,10,35,11],[35,12,35,13],[33,2,33,6],[33,7,33,9],[33,10,33,11],[33,12,33,13],[13,12,13,13],[31,12,31,13],[29,2,29,6],[25,2,25,6],[25,12,25,13],[27,2,27,6],[19,2,19,6],[9,2,9,6],[31,2,31,6],[31,7,31,9],[31,10,31,11],[2,3,2,13],[7,2,7,6],[4,2,4,6],[29,7,29,9],[29,10,29,11],[27,7,27,9],[27,10,27,11],[27,12,27,13],[29,12,29,13],[23,2,23,6],[23,7,23,9],[23,12,23,13]]}
[]
[]
[null,null,null,"Summation of All Irrigation Requirements",null,null,null,null,null,null,null,null,null,null,{"$f":"IF(InputControl!$B$12=2,\"(2-in-10)\",\"(1-in-10)\")","v":"(1-in-10)"}]
[]
[null,"No.","Parcel Name",null,null,null,null,"Crop",null,null,"acres",null,"Plant No. in Parcel",null,"Multiple Plantings in Parcel","Salt Flush"]
[null,"Inches","Jan","Feb","Mar","Apr","May","Jun","Jul","Aug","Sep","Oct","Nov","Dec","Mx Mon","Annual"," "]
[]
[null,{"$f":"IF('Crop Count'!A10<>\"\",'Crop Count'!A10,\"\")","v":1},{"$f":"IF('Crop Count'!A10<>\"\",'Crop Count'!E10,\"\")","v":" "},null,null,null,null,{"$f":"IF('Crop Count'!A10<>\"\",'Crop Count'!G10,\"\")","v":"Pasture"},null,null,{"$f":"IF('Crop Count'!A10<>\"\",'Crop Count'!H10,\"\")","v":217},null,{"$f":"IF('Crop Count'!A10<>\"\",'Crop Count'!B10,\"\")","v":1},null,{"$f":"IF('Crop Count'!A10<>\"\",'Crop Count'!C10,\"\")","v":"NO"},{"$f":"IF('Crop Count'!A10<>\"\",'Crop Count'!D10,\"\")","v":"NO"}]
[null,null,{"$f":"IF('Crop Count'!$A10<>\"\",'Crop Count'!N55,\"\")","v":0.95},{"$f":"IF('Crop Count'!$A10<>\"\",'Crop Count'!O55,\"\")","v":1.35},{"$f":"IF('Crop Count'!$A10<>\"\",'Crop Count'!P55,\"\")","v":2.29},{"$f":"IF('Crop Count'!$A10<>\"\",'Crop Count'!Q55,\"\")","v":2.92},{"$f":"IF('Crop Count'!$A10<>\"\",'Crop Count'!R55,\"\")","v":3.26},{"$f":"IF('Crop Count'!$A10<>\"\",'Crop Count'!S55,\"\")","v":1.43},{"$f":"IF('Crop Count'!$A10<>\"\",'Crop Count'!T55,\"\")","v":2.02},{"$f":"IF('Crop Count'!$A10<>\"\",'Crop Count'!U55,\"\")","v":2.14},{"$f":"IF('Crop Count'!$A10<>\"\",'Crop Count'!V55,\"\")","v":1.21},{"$f":"IF('Crop Count'!$A10<>\"\",'Crop Count'!W55,\"\")","v":1.85},{"$f":"IF('Crop Count'!$A10<>\"\",'Crop Count'!X55,\"\")","v":1.49},{"$f":"IF('Crop Count'!$A10<>\"\",'Crop Count'!Y55,\"\")","v":1.02},{"$f":"IF(AND('Crop Count'!$A10<>\"\",'Crop Count'!AC55<>\"\"),'Crop Count'!AC55,IF('Crop Count'!$A10<>\"\",'Crop Count'!AA55,\"\"))","v":3.26},{"$f":"IF('Crop Count'!$A10<>\"\",'Crop Count'!Z55,\"\")","v":21.93}," "]
[null,{"$f":"IF('Crop Count'!A11<>\"\",'Crop Count'!A11,\"\")","v":2},{"$f":"IF('Crop Count'!A11<>\"\",'Crop Count'!E11,\"\")","v":" "},null,null,null,null,{"$f":"IF('Crop Count'!A11<>\"\",'Crop Count'!G11,\"\")","v":"Sugarcane"},null,null,{"$f":"IF('Crop Count'!A11<>\"\",'Crop Count'!H11,\"\")","v":156},null,{"$f":"IF('Crop Count'!A11<>\"\",'Crop Count'!B11,\"\")","v":1},null,{"$f":"IF('Crop Count'!A11<>\"\",'Crop Count'!C11,\"\")","v":"NO"},{"$f":"IF('Crop Count'!A11<>\"\",'Crop Count'!D11,\"\")","v":"NO"}]
[null,null,{"$f":"IF('Crop Count'!$A11<>\"\",'Crop Count'!N56,\"\")","v":0.71},{"$f":"IF('Crop Count'!$A11<>\"\",'Crop Count'!O56,\"\")","v":0.33},{"$f":"IF('Crop Count'!$A11<>\"\",'Crop Count'!P56,\"\")","v":1.83},{"$f":"IF('Crop Count'!$A11<>\"\",'Crop Count'!Q56,\"\")","v":2.54},{"$f":"IF('Crop Count'!$A11<>\"\",'Crop Count'!R56,\"\")","v":3.26},{"$f":"IF('Crop Count'!$A11<>\"\",'Crop Count'!S56,\"\")","v":3.16},{"$f":"IF('Crop Count'!$A11<>\"\",'Crop Count'!T56,\"\")","v":3.66},{"$f":"IF('Crop Count'!$A11<>\"\",'Crop Count'!U56,\"\")","v":3.95},{"$f":"IF('Crop Count'!$A11<>\"\",'Crop Count'!V56,\"\")","v":2.5},{"$f":"IF('Crop Count'!$A11<>\"\",'Crop Count'!W56,\"\")","v":3.8},{"$f":"IF('Crop Count'!$A11<>\"\",'Crop Count'!X56,\"\")","v":2.4700000000000002},{"$f":"IF('Crop Count'!$A11<>\"\",'Crop Count'!Y56,\"\")","v":1.93},{"$f":"IF(AND('Crop Count'!$A11<>\"\",'Crop Count'!AC56<>\"\"),'Crop Count'!AC56,IF('Crop Count'!$A11<>\"\",'Crop Count'!AA56,\"\"))","v":3.95},{"$f":"IF('Crop Count'!$A11<>\"\",'Crop Count'!Z56,\"\")","v":30.14}," "]
[null,{"$f":"IF('Crop Count'!A12<>\"\",'Crop Count'!A12,\"\")","v":3},{"$f":"IF('Crop Count'!A12<>\"\",'Crop Count'!E12,\"\")","v":" "},null,null,null,null,{"$f":"IF('Crop Count'!A12<>\"\",'Crop Count'!G12,\"\")","v":"Citrus"},null,null,{"$f":"IF('Crop Count'!A12<>\"\",'Crop Count'!H12,\"\")","v":1810},null,{"$f":"IF('Crop Count'!A12<>\"\",'Crop Count'!B12,\"\")","v":1},null,{"$f":"IF('Crop Count'!A12<>\"\",'Crop Count'!C12,\"\")","v":"NO"},{"$f":"IF('Crop Count'!A12<>\"\",'Crop Count'!D12,\"\")","v":"NO"}]
[null,null,{"$f":"IF('Crop Count'!$A12<>\"\",'Crop Count'!N57,\"\")","v":1.55},{"$f":"IF('Crop Count'!$A12<>\"\",'Crop Count'!O57,\"\")","v":1.56},{"$f":"IF('Crop Count'!$A12<>\"\",'Crop Count'!P57,\"\")","v":2.52},{"$f":"IF('Crop Count'!$A12<>\"\",'Crop Count'!Q57,\"\")","v":3.03},{"$f":"IF('Crop Count'!$A12<>\"\",'Crop Count'!R57,\"\")","v":3.33},{"$f":"IF('Crop Count'!$A12<>\"\",'Crop Count'!S57,\"\")","v":2.64},{"$f":"IF('Crop Count'!$A12<>\"\",'Crop Count'!T57,\"\")","v":3.09},{"$f":"IF('Crop Count'!$A12<>\"\",'Crop Count'!U57,\"\")","v":3.05},{"$f":"IF('Crop Count'!$A12<>\"\",'Crop Count'!V57,\"\")","v":2.3199999999999998},{"$f":"IF('Crop Count'!$A12<>\"\",'Crop Count'!W57,\"\")","v":2.69},{"$f":"IF('Crop Count'!$A12<>\"\",'Crop Count'!X57,\"\")","v":2.2599999999999998},{"$f":"IF('Crop Count'!$A12<>\"\",'Crop Count'!Y57,\"\")","v":1.75},{"$f":"IF(AND('Crop Count'!$A12<>\"\",'Crop Count'!AC57<>\"\"),'Crop Count'!AC57,IF('Crop Count'!$A12<>\"\",'Crop Count'!AA57,\"\"))","v":5.16},{"$f":"IF('Crop Count'!$A12<>\"\",'Crop Count'!Z57,\"\")","v":29.79}," "]
[null,{"$f":"IF('Crop Count'!A13<>\"\",'Crop Count'!A13,\"\")","v":""},{"$f":"IF('Crop Count'!A13<>\"\",'Crop Count'!E13,IF(OR(AND(C10=\"Total Maximum Monthly Demand = \",C12=\"Total Annual Demand = \"),AND(C10=\"\",C12=\"\")),\"\",IF(AND(C10=\"\",C12=\"Total Maximum Monthly Demand = \"),\"Total Annual Demand = \",IF(OR(C10=\"Total Annual Demand = \",C10=\"\",C12<>\"\"),\"\",\"Total Maximum Monthly Demand = \"))))","v":""},null,null,null,null,{"$f":"IF('Crop Count'!A13<>\"\",'Crop Count'!G13,IF(C14=\"Total Maximum Monthly Demand = \",CONCATENATE('Crop Count'!$AI$30,'Crop Count'!$AI$31), IF(C14=\"Total Annual Demand = \",CONCATENATE('Crop Count'!$AJ$30,'Crop Count'!$AJ$31),\"\")))","v":""},null,null,{"$f":"IF('Crop Count'!A13<>\"\",'Crop Count'!H13,\"\")","v":""},null,{"$f":"IF('Crop Count'!A13<>\"\",'Crop Count'!B13,\"\")","v":""},null,{"$f":"IF('Crop Count'!A13<>\"\",'Crop Count'!C13,\"\")","v":""},{"$f":"IF('Crop Count'!A13<>\"\",'Crop Count'!D13,\"\")","v":""}]
[null,null,{"$f":"IF('Crop Count'!$A13<>\"\",'Crop Count'!N58,\"\")","v":""},{"$f":"IF('Crop Count'!$A13<>\"\",'Crop Count'!O58,\"\")","v":""},{"$f":"IF('Crop Count'!$A13<>\"\",'Crop Count'!P58,\"\")","v":""},{"$f":"IF('Crop Count'!$A13<>\"\",'Crop Count'!Q58,\"\")","v":""},{"$f":"IF('Crop Count'!$A13<>\"\",'Crop Count'!R58,\"\")","v":""},{"$f":"IF('Crop Count'!$A13<>\"\",'Crop Count'!S58,\"\")","v":""},{"$f":"IF('Crop Count'!$A13<>\"\",'Crop Count'!T58,\"\")","v":""},{"$f":"IF('Crop Count'!$A13<>\"\",'Crop Count'!U58,\"\")","v":""},{"$f":"IF('Crop Count'!$A13<>\"\",'Crop Count'!V58,\"\")","v":""},{"$f":"IF('Crop Count'!$A13<>\"\",'Crop Count'!W58,\"\")","v":""},{"$f":"IF('Crop Count'!$A13<>\"\",'Crop Count'!X58,\"\")","v":""},{"$f":"IF('Crop Count'!$A13<>\"\",'Crop Count'!Y58,\"\")","v":""},{"$f":"IF(AND('Crop Count'!$A13<>\"\",'Crop Count'!AC58<>\"\"),'Crop Count'!AC58,IF('Crop Count'!$A13<>\"\",'Crop Count'!AA58,\"\"))","v":""},{"$f":"IF('Crop Count'!$A13<>\"\",'Crop Count'!Z58,\"\")","v":""}," "]
[null,{"$f":"IF('Crop Count'!A14<>\"\",'Crop Count'!A14,\"\")","v":""},{"$f":"IF('Crop Count'!A14<>\"\",'Crop Count'!E14,IF(OR(AND(C12=\"Total Maximum Monthly Demand = \",C14=\"Total Annual Demand = \"),AND(C12=\"\",C14=\"\")),\"\",IF(AND(C12=\"\",C14=\"Total Maximum Monthly Demand = \"),\"Total Annual Demand = \",IF(OR(C12=\"Total Annual Demand = \",C12=\"\",C14<>\"\"),\"\",\"Total Maximum Monthly Demand = \"))))","v":"Total Maximum Monthly Demand = "},null,null,null,null,{"$f":"IF('Crop Count'!A14<>\"\",'Crop Count'!G14,IF(C16=\"Total Maximum Monthly Demand = \",CONCATENATE('Crop Count'!$AI$30,'Crop Count'!$AI$31), IF(C16=\"Total Annual Demand = \",CONCATENATE('Crop Count'!$AJ$30,'Crop Count'!$AJ$31),\"\")))","v":"365.24 MG"},null,null,{"$f":"IF('Crop Count'!A14<>\"\",'Crop Count'!H14,\"\")","v":""},null,{"$f":"IF('Crop Count'!A14<>\"\",'Crop Count'!B14,\"\")","v":""},null,{"$f":"IF('Crop Count'!A14<>\"\",'Crop Count'!C14,\"\")","v":""},{"$f":"IF('Crop Count'!A14<>\"\",'Crop Count'!D14,\"\")","v":""}]
[null,null,{"$f":"IF('Crop Count'!$A14<>\"\",'Crop Count'!N59,\"\")","v":""},{"$f":"IF('Crop Count'!$A14<>\"\",'Crop Count'!O59,\"\")","v":""},{"$f":"IF('Crop Count'!$A14<>\"\",'Crop Count'!P59,\"\")","v":""},{"$f":"IF('Crop Count'!$A14<>\"\",'Crop Count'!Q59,\"\")","v":""},{"$f":"IF('Crop Count'!$A14<>\"\",'Crop Count'!R59,\"\")","v":""},{"$f":"IF('Crop Count'!$A14<>\"\",'Crop Count'!S59,\"\")","v":""},{"$f":"IF('Crop Count'!$A14<>\"\",'Crop Count'!T59,\"\")","v":""},{"$f":"IF('Crop Count'!$A14<>\"\",'Crop Count'!U59,\"\")","v":""},{"$f":"IF('Crop Count'!$A14<>\"\",'Crop Count'!V59,\"\")","v":""},{"$f":"IF('Crop Count'!$A14<>\"\",'Crop Count'!W59,\"\")","v":""},{"$f":"IF('Crop Count'!$A14<>\"\",'Crop Count'!X59,\"\")","v":""},{"$f":"IF('Crop Count'!$A14<>\"\",'Crop Count'!Y59,\"\")","v":""},{"$f":"IF(AND('Crop Count'!$A14<>\"\",'Crop Count'!AC59<>\"\"),'Crop Count'!AC59,IF('Crop Count'!$A14<>\"\",'Crop Count'!AA59,\"\"))","v":""},{"$f":"IF('Crop Count'!$A14<>\"\",'Crop Count'!Z59,\"\")","v":""}," "]
[null,{"$f":"IF('Crop Count'!A15<>\"\",'Crop Count'!A15,\"\")","v":""},{"$f":"IF('Crop Count'!A15<>\"\",'Crop Count'!E15,IF(OR(AND(C14=\"Total Maximum Monthly Demand = \",C16=\"Total Annual Demand = \"),AND(C14=\"\",C16=\"\")),\"\",IF(AND(C14=\"\",C16=\"Total Maximum Monthly Demand = \"),\"Total Annual Demand = \",IF(OR(C14=\"Total Annual Demand  = \",C14=\"\",C16<>\"\"),\"\",\"Total Maximum Monthly Demand = \"))))","v":"Total Annual Demand = "},null,null,null,null,{"$f":"IF('Crop Count'!A15<>\"\",'Crop Count'!G15,IF(C18=\"Total Maximum Monthly Demand = \",CONCATENATE('Crop Count'!$AI$30,'Crop Count'!$AI$31), IF(C18=\"Total Annual Demand = \",CONCATENATE('Crop Count'!$AJ$30,'Crop Count'!$AJ$31),\"\")))","v":"2,241.15 MG"},null,null,{"$f":"IF('Crop Count'!A15<>\"\",'Crop Count'!H15,\"\")","v":""},null,{"$f":"IF('Crop Count'!A15<>\"\",'Crop Count'!B15,\"\")","v":""},null,{"$f":"IF('Crop Count'!A15<>\"\",'Crop Count'!C15,\"\")","v":""},{"$f":"IF('Crop Count'!A15<>\"\",'Crop Count'!D15,\"\")","v":""}]
[null,null,{"$f":"IF('Crop Count'!$A15<>\"\",'Crop Count'!N60,\"\")","v":""},{"$f":"IF('Crop Count'!$A15<>\"\",'Crop Count'!O60,\"\")","v":""},{"$f":"IF('Crop Count'!$A15<>\"\",'Crop Count'!P60,\"\")","v":""},{"$f":"IF('Crop Count'!$A15<>\"\",'Crop Count'!Q60,\"\")","v":""},{"$f":"IF('Crop Count'!$A15<>\"\",'Crop Count'!R60,\"\")","v":""},{"$f":"IF('Crop Count'!$A15<>\"\",'Crop Count'!S60,\"\")","v":""},{"$f":"IF('Crop Count'!$A15<>\"\",'Crop Count'!T60,\"\")","v":""},{"$f":"IF('Crop Count'!$A15<>\"\",'Crop Count'!U60,\"\")","v":""},{"$f":"IF('Crop Count'!$A15<>\"\",'Crop Count'!V60,\"\")","v":""},{"$f":"IF('Crop Count'!$A15<>\"\",'Crop Count'!W60,\"\")","v":""},{"$f":"IF('Crop Count'!$A15<>\"\",'Crop Count'!X60,\"\")","v":""},{"$f":"IF('Crop Count'!$A15<>\"\",'Crop Count'!Y60,\"\")","v":""},{"$f":"IF(AND('Crop Count'!$A15<>\"\",'Crop Count'!AC60<>\"\"),'Crop Count'!AC60,IF('Crop Count'!$A15<>\"\",'Crop Count'!AA60,\"\"))","v":""},{"$f":"IF('Crop Count'!$A15<>\"\",'Crop Count'!Z60,\"\")","v":""}," "]
[null,{"$f":"IF('Crop Count'!A16<>\"\",'Crop Count'!A16,\"\")","v":""},{"$f":"IF('Crop Count'!A16<>\"\",'Crop Count'!E16,IF(OR(AND(C16=\"Total Maximum Monthly Demand = \",C18=\"Total Annual Demand = \"),AND(C16=\"\",C18=\"\")),\"\",IF(AND(C16=\"\",C18=\"Total Maximum Monthly Demand = \"),\"Total Annual Demand = \",IF(OR(C16=\"Total Annual Demand = \",C16=\"\",C18<>\"\"),\"\",\"Total Maximum Monthly Demand = \"))))","v":""},null,null,null,null,{"$f":"IF('Crop Count'!A16<>\"\",'Crop Count'!G16,IF(C20=\"Total Maximum Monthly Demand = \",CONCATENATE('Crop Count'!$AI$30,'Crop Count'!$AI$31), IF(C20=\"Total Annual Demand = \",CONCATENATE('Crop Count'!$AJ$30,'Crop Count'!$AJ$31),\"\")))","v":""},null,null,{"$f":"IF('Crop Count'!A16<>\"\",'Crop Count'!H16,\"\")","v":""},null,{"$f":"IF('Crop Count'!A16<>\"\",'Crop Count'!B16,\"\")","v":""},null,{"$f":"IF('Crop Count'!A16<>\"\",'Crop Count'!C16,\"\")","v":""},{"$f":"IF('Crop Count'!A16<>\"\",'Crop Count'!D16,\"\")","v":""}]
[null,null,{"$f":"IF('Crop Count'!$A16<>\"\",'Crop Count'!N61,\"\")","v":""},{"$f":"IF('Crop Count'!$A16<>\"\",'Crop Count'!O61,\"\")","v":""},{"$f":"IF('Crop Count'!$A16<>\"\",'Crop Count'!P61,\"\")","v":""},{"$f":"IF('Crop Count'!$A16<>\"\",'Crop Count'!Q61,\"\")","v":""},{"$f":"IF('Crop Count'!$A16<>\"\",'Crop Count'!R61,\"\")","v":""},{"$f":"IF('Crop Count'!$A16<>\"\",'Crop Count'!S61,\"\")","v":""},{"$f":"IF('Crop Count'!$A16<>\"\",'Crop Count'!T61,\"\")","v":""},{"$f":"IF('Crop Count'!$A16<>\"\",'Crop Count'!U61,\"\")","v":""},{"$f":"IF('Crop Count'!$A16<>\"\",'Crop Count'!V61,\"\")","v":""},{"$f":"IF('Crop Count'!$A16<>\"\",'Crop Count'!W61,\"\")","v":""},{"$f":"IF('Crop Count'!$A16<>\"\",'Crop Count'!X61,\"\")","v":""},{"$f":"IF('Crop Count'!$A16<>\"\",'Crop Count'!Y61,\"\")","v":""},{"$f":"IF(AND('Crop Count'!$A16<>\"\",'Crop Count'!AC61<>\"\"),'Crop Count'!AC61,IF('Crop Count'!$A16<>\"\",'Crop Count'!AA61,\"\"))","v":""},{"$f":"IF('Crop Count'!$A16<>\"\",'Crop Count'!Z61,\"\")","v":""}," "]
[null,{"$f":"IF('Crop Count'!A17<>\"\",'Crop Count'!A17,\"\")","v":""},{"$f":"IF('Crop Count'!A17<>\"\",'Crop Count'!E17,IF(OR(AND(C18=\"Total Maximum Monthly Demand = \",C20=\"Total Annual Demand = \"),AND(C18=\"\",C20=\"\")),\"\",IF(AND(C18=\"\",C20=\"Total Maximum Monthly Demand = \"),\"Total Annual Demand = \",IF(OR(C18=\"Total Annual Demand = \",C18=\"\",C20<>\"\"),\"\",\"Total Maximum Monthly Demand = \"))))","v":""},null,null,null,null,{"$f":"IF('Crop Count'!A17<>\"\",'Crop Count'!G17,IF(C22=\"Total Maximum Monthly Demand = \",CONCATENATE('Crop Count'!$AI$30,'Crop Count'!$AI$31), IF(C22=\"Total Annual Demand = \",CONCATENATE('Crop Count'!$AJ$30,'Crop Count'!$AJ$31),\"\")))","v":""},null,null,{"$f":"IF('Crop Count'!A17<>\"\",'Crop Count'!H17,\"\")","v":""},null,{"$f":"IF('Crop Count'!A17<>\"\",'Crop Count'!B17,\"\")","v":""},null,{"$f":"IF('Crop Count'!A17<>\"\",'Crop Count'!C17,\"\")","v":""},{"$f":"IF('Crop Count'!A17<>\"\",'Crop Count'!D17,\"\")","v":""}]
[null,null,{"$f":"IF('Crop Count'!$A17<>\"\",'Crop Count'!N62,\"\")","v":""},{"$f":"IF('Crop Count'!$A17<>\"\",'Crop Count'!O62,\"\")","v":""},{"$f":"IF('Crop Count'!$A17<>\"\",'Crop Count'!P62,\"\")","v":""},{"$f":"IF('Crop Count'!$A17<>\"\",'Crop Count'!Q62,\"\")","v":""},{"$f":"IF('Crop Count'!$A17<>\"\",'Crop Count'!R62,\"\")","v":""},{"$f":"IF('Crop Count'!$A17<>\"\",'Crop Count'!S62,\"\")","v":""},{"$f":"IF('Crop Count'!$A17<>\"\",'Crop Count'!T62,\"\")","v":""},{"$f":"IF('Crop Count'!$A17<>\"\",'Crop Count'!U62,\"\")","v":""},{"$f":"IF('Crop Count'!$A17<>\"\",'Crop Count'!V62,\"\")","v":""},{"$f":"IF('Crop Count'!$A17<>\"\",'Crop Count'!W62,\"\")","v":""},{"$f":"IF('Crop Count'!$A17<>\"\",'Crop Count'!X62,\"\")","v":""},{"$f":"IF('Crop Count'!$A17<>\"\",'Crop Count'!Y62,\"\")","v":""},{"$f":"IF(AND('Crop Count'!$A17<>\"\",'Crop Count'!AC62<>\"\"),'Crop Count'!AC62,IF('Crop Count'!$A17<>\"\",'Crop Count'!AA62,\"\"))","v":""},{"$f":"IF('Crop Count'!$A17<>\"\",'Crop Count'!Z62,\"\")","v":""}," "]
[null,{"$f":"IF('Crop Count'!A18<>\"\",'Crop Count'!A18,\"\")","v":""},{"$f":"IF('Crop Count'!A18<>\"\",'Crop Count'!E18,IF(OR(AND(C20=\"Total Maximum Monthly Demand = \",C22=\"Total Annual Demand = \"),AND(C20=\"\",C22=\"\")),\"\",IF(AND(C20=\"\",C22=\"Total Maximum Monthly Demand = \"),\"Total Annual Demand = \",IF(OR(C20=\"Total Annual Demand = \",C20=\"\",C22<>\"\"),\"\",\"Total Maximum Monthly Demand = \"))))","v":""},null,null,null,null,{"$f":"IF('Crop Count'!A18<>\"\",'Crop Count'!G18,IF(C24=\"Total Maximum Monthly Demand = \",CONCATENATE('Crop Count'!$AI$30,'Crop Count'!$AI$31), IF(C24=\"Total Annual Demand = \",CONCATENATE('Crop Count'!$AJ$30,'Crop Count'!$AJ$31),\"\")))","v":""},null,null,{"$f":"IF('Crop Count'!A18<>\"\",'Crop Count'!H18,\"\")","v":""},null,{"$f":"IF('Crop Count'!A18<>\"\",'Crop Count'!B18,\"\")","v":""},null,{"$f":"IF('Crop Count'!A18<>\"\",'Crop Count'!C18,\"\")","v":""},{"$f":"IF('Crop Count'!A18<>\"\",'Crop Count'!D18,\"\")","v":""}]
[null,null,{"$f":"IF('Crop Count'!$A18<>\"\",'Crop Count'!N63,\"\")","v":""},{"$f":"IF('Crop Count'!$A18<>\"\",'Crop Count'!O63,\"\")","v":""},{"$f":"IF('Crop Count'!$A18<>\"\",'Crop Count'!P63,\"\")","v":""},{"$f":"IF('Crop Count'!$A18<>\"\",'Crop Count'!Q63,\"\")","v":""},{"$f":"IF('Crop Count'!$A18<>\"\",'Crop Count'!R63,\"\")","v":""},{"$f":"IF('Crop Count'!$A18<>\"\",'Crop Count'!S63,\"\")","v":""},{"$f":"IF('Crop Count'!$A18<>\"\",'Crop Count'!T63,\"\")","v":""},{"$f":"IF('Crop Count'!$A18<>\"\",'Crop Count'!U63,\"\")","v":""},{"$f":"IF('Crop Count'!$A18<>\"\",'Crop Count'!V63,\"\")","v":""},{"$f":"IF('Crop Count'!$A18<>\"\",'Crop Count'!W63,\"\")","v":""},{"$f":"IF('Crop Count'!$A18<>\"\",'Crop Count'!X63,\"\")","v":""},{"$f":"IF('Crop Count'!$A18<>\"\",'Crop Count'!Y63,\"\")","v":""},{"$f":"IF(AND('Crop Count'!$A18<>\"\",'Crop Count'!AC63<>\"\"),'Crop Count'!AC63,IF('Crop Count'!$A18<>\"\",'Crop Count'!AA63,\"\"))","v":""},{"$f":"IF('Crop Count'!$A18<>\"\",'Crop Count'!Z63,\"\")","v":""}," "]
[null,{"$f":"IF('Crop Count'!A19<>\"\",'Crop Count'!A19,\"\")","v":""},{"$f":"IF('Crop Count'!A19<>\"\",'Crop Count'!E19,IF(OR(AND(C22=\"Total Maximum Monthly Demand = \",C24=\"Total Annual Demand = \"),AND(C22=\"\",C24=\"\")),\"\",IF(AND(C22=\"\",C24=\"Total Maximum Monthly Demand = \"),\"Total Annual Demand = \",IF(OR(C22=\"Total Annual Demand = \",C22=\"\",C24<>\"\"),\"\",\"Total Maximum Monthly Demand = \"))))","v":""},null,null,null,null,{"$f":"IF('Crop Count'!A19<>\"\",'Crop Count'!G19,IF(C26=\"Total Maximum Monthly Demand = \",CONCATENATE('Crop Count'!$AI$30,'Crop Count'!$AI$31), IF(C26=\"Total Annual Demand = \",CONCATENATE('Crop Count'!$AJ$30,'Crop Count'!$AJ$31),\"\")))","v":""},null,null,{"$f":"IF('Crop Count'!A19<>\"\",'Crop Count'!H19,\"\")","v":""},null,{"$f":"IF('Crop Count'!A19<>\"\",'Crop Count'!B19,\"\")","v":""},null,{"$f":"IF('Crop Count'!A19<>\"\",'Crop Count'!C19,\"\")","v":""},{"$f":"IF('Crop Count'!A19<>\"\",'Crop Count'!D19,\"\")","v":""}]
[null,null,{"$f":"IF('Crop Count'!$A19<>\"\",'Crop Count'!N64,\"\")","v":""},{"$f":"IF('Crop Count'!$A19<>\"\",'Crop Count'!O64,\"\")","v":""},{"$f":"IF('Crop Count'!$A19<>\"\",'Crop Count'!P64,\"\")","v":""},{"$f":"IF('Crop Count'!$A19<>\"\",'Crop Count'!Q64,\"\")","v":""},{"$f":"IF('Crop Count'!$A19<>\"\",'Crop Count'!R64,\"\")","v":""},{"$f":"IF('Crop Count'!$A19<>\"\",'Crop Count'!S64,\"\")","v":""},{"$f":"IF('Crop Count'!$A19<>\"\",'Crop Count'!T64,\"\")","v":""},{"$f":"IF('Crop Count'!$A19<>\"\",'Crop Count'!U64,\"\")","v":""},{"$f":"IF('Crop Count'!$A19<>\"\",'Crop Count'!V64,\"\")","v":""},{"$f":"IF('Crop Count'!$A19<>\"\",'Crop Count'!W64,\"\")","v":""},{"$f":"IF('Crop Count'!$A19<>\"\",'Crop Count'!X64,\"\")","v":""},{"$f":"IF('Crop Count'!$A19<>\"\",'Crop Count'!Y64,\"\")","v":""},{"$f":"IF(AND('Crop Count'!$A19<>\"\",'Crop Count'!AC64<>\"\"),'Crop Count'!AC64,IF('Crop Count'!$A19<>\"\",'Crop Count'!AA64,\"\"))","v":""},{"$f":"IF('Crop Count'!$A19<>\"\",'Crop Count'!Z64,\"\")","v":""}," "]
[null,{"$f":"IF('Crop Count'!A20<>\"\",'Crop Count'!A20,\"\")","v":""},{"$f":"IF('Crop Count'!A20<>\"\",'Crop Count'!E20,IF(OR(AND(C24=\"Total Maximum Monthly Demand = \",C26=\"Total Annual Demand = \"),AND(C24=\"\",C26=\"\")),\"\",IF(AND(C24=\"\",C26=\"Total Maximum Monthly Demand = \"),\"Total Annual Demand = \",IF(OR(C24=\"Total Annual Demand = \",C24=\"\",C26<>\"\"),\"\",\"Total Maximum Monthly Demand = \"))))","v":""},null,null,null,null,{"$f":"IF('Crop Count'!A20<>\"\",'Crop Count'!G20,IF(C28=\"Total Maximum Monthly Demand = \",CONCATENATE('Crop Count'!$AI$30,'Crop Count'!$AI$31), IF(C28=\"Total Annual Demand = \",CONCATENATE('Crop Count'!$AJ$30,'Crop Count'!$AJ$31),\"\")))","v":""},null,null,{"$f":"IF('Crop Count'!A20<>\"\",'Crop Count'!H20,\"\")","v":""},null,{"$f":"IF('Crop Count'!A20<>\"\",'Crop Count'!B20,\"\")","v":""},null,{"$f":"IF('Crop Count'!A20<>\"\",'Crop Count'!C20,\"\")","v":""},{"$f":"IF('Crop Count'!A20<>\"\",'Crop Count'!D20,\"\")","v":""}]
[null,null,{"$f":"IF('Crop Count'!$A20<>\"\",'Crop Count'!N65,\"\")","v":""},{"$f":"IF('Crop Count'!$A20<>\"\",'Crop Count'!O65,\"\")","v":""},{"$f":"IF('Crop Count'!$A20<>\"\",'Crop Count'!P65,\"\")","v":""},{"$f":"IF('Crop Count'!$A20<>\"\",'Crop Count'!Q65,\"\")","v":""},{"$f":"IF('Crop Count'!$A20<>\"\",'Crop Count'!R65,\"\")","v":""},{"$f":"IF('Crop Count'!$A20<>\"\",'Crop Count'!S65,\"\")","v":""},{"$f":"IF('Crop Count'!$A20<>\"\",'Crop Count'!T65,\"\")","v":""},{"$f":"IF('Crop Count'!$A20<>\"\",'Crop Count'!U65,\"\")","v":""},{"$f":"IF('Crop Count'!$A20<>\"\",'Crop Count'!V65,\"\")","v":""},{"$f":"IF('Crop Count'!$A20<>\"\",'Crop Count'!W65,\"\")","v":""},{"$f":"IF('Crop Count'!$A20<>\"\",'Crop Count'!X65,\"\")","v":""},{"$f":"IF('Crop Count'!$A20<>\"\",'Crop Count'!Y65,\"\")","v":""},{"$f":"IF(AND('Crop Count'!$A20<>\"\",'Crop Count'!AC65<>\"\"),'Crop Count'!AC65,IF('Crop Count'!$A20<>\"\",'Crop Count'!AA65,\"\"))","v":""},{"$f":"IF('Crop Count'!$A20<>\"\",'Crop Count'!Z65,\"\")","v":""}," "]
[null,{"$f":"IF('Crop Count'!A21<>\"\",'Crop Count'!A21,\"\")","v":""},{"$f":"IF('Crop Count'!A21<>\"\",'Crop Count'!E21,IF(OR(AND(C26=\"Total Maximum Monthly Demand = \",C28=\"Total Annual Demand = \"),AND(C26=\"\",C28=\"\")),\"\",IF(AND(C26=\"\",C28=\"Total Maximum Monthly Demand = \"),\"Total Annual Demand = \",IF(OR(C26=\"Total Annual Demand = \",C26=\"\",C28<>\"\"),\"\",\"Total Maximum Monthly Demand = \"))))","v":""},null,null,null,null,{"$f":"IF('Crop Count'!A21<>\"\",'Crop Count'!G21,IF(C30=\"Total Maximum Monthly Demand = \",CONCATENATE('Crop Count'!$AI$30,'Crop Count'!$AI$31), IF(C30=\"Total Annual Demand = \",CONCATENATE('Crop Count'!$AJ$30,'Crop Count'!$AJ$31),\"\")))","v":""},null,null,{"$f":"IF('Crop Count'!A21<>\"\",'Crop Count'!H21,\"\")","v":""},null,{"$f":"IF('Crop Count'!A21<>\"\",'Crop Count'!B21,\"\")","v":""},null,{"$f":"IF('Crop Count'!A21<>\"\",'Crop Count'!C21,\"\")","v":""},{"$f":"IF('Crop Count'!A21<>\"\",'Crop Count'!D21,\"\")","v":""}]
[null,null,{"$f":"IF('Crop Count'!$A21<>\"\",'Crop Count'!N66,\"\")","v":""},{"$f":"IF('Crop Count'!$A21<>\"\",'Crop Count'!O66,\"\")","v":""},{"$f":"IF('Crop Count'!$A21<>\"\",'Crop Count'!P66,\"\")","v":""},{"$f":"IF('Crop Count'!$A21<>\"\",'Crop Count'!Q66,\"\")","v":""},{"$f":"IF('Crop Count'!$A21<>\"\",'Crop Count'!R66,\"\")","v":""},{"$f":"IF('Crop Count'!$A21<>\"\",'Crop Count'!S66,\"\")","v":""},{"$f":"IF('Crop Count'!$A21<>\"\",'Crop Count'!T66,\"\")","v":""},{"$f":"IF('Crop Count'!$A21<>\"\",'Crop Count'!U66,\"\")","v":""},{"$f":"IF('Crop Count'!$A21<>\"\",'Crop Count'!V66,\"\")","v":""},{"$f":"IF('Crop Count'!$A21<>\"\",'Crop Count'!W66,\"\")","v":""},{"$f":"IF('Crop Count'!$A21<>\"\",'Crop Count'!X66,\"\")","v":""},{"$f":"IF('Crop Count'!$A21<>\"\",'Crop Count'!Y66,\"\")","v":""},{"$f":"IF(AND('Crop Count'!$A21<>\"\",'Crop Count'!AC66<>\"\"),'Crop Count'!AC66,IF('Crop Count'!$A21<>\"\",'Crop Count'!AA66,\"\"))","v":""},{"$f":"IF('Crop Count'!$A21<>\"\",'Crop Count'!Z66,\"\")","v":""}," "]
[null,{"$f":"IF('Crop Count'!A22<>\"\",'Crop Count'!A22,\"\")","v":""},{"$f":"IF('Crop Count'!A22<>\"\",'Crop Count'!E22,IF(OR(AND(C28=\"Total Maximum Monthly Demand = \",C30=\"Total Annual Demand = \"),AND(C28=\"\",C30=\"\")),\"\",IF(AND(C28=\"\",C30=\"Total Maximum Monthly Demand = \"),\"Total Annual Demand = \",IF(OR(C28=\"Total Annual Demand = \",C28=\"\",C30<>\"\"),\"\",\"Total Maximum Monthly Demand = \"))))","v":""},null,null,null,null,{"$f":"IF('Crop Count'!A22<>\"\",'Crop Count'!G22,IF(C32=\"Total Maximum Monthly Demand = \",CONCATENATE('Crop Count'!$AI$30,'Crop Count'!$AI$31), IF(C32=\"Total Annual Demand = \",CONCATENATE('Crop Count'!$AJ$30,'Crop Count'!$AJ$31),\"\")))","v":""},null,null,{"$f":"IF('Crop Count'!A22<>\"\",'Crop Count'!H22,\"\")","v":""},null,{"$f":"IF('Crop Count'!A22<>\"\",'Crop Count'!B22,\"\")","v":""},null,{"$f":"IF('Crop Count'!A22<>\"\",'Crop Count'!C22,\"\")","v":""},{"$f":"IF('Crop Count'!A22<>\"\",'Crop Count'!D22,\"\")","v":""}]
[null,null,{"$f":"IF('Crop Count'!$A22<>\"\",'Crop Count'!N67,\"\")","v":""},{"$f":"IF('Crop Count'!$A22<>\"\",'Crop Count'!O67,\"\")","v":""},{"$f":"IF('Crop Count'!$A22<>\"\",'Crop Count'!P67,\"\")","v":""},{"$f":"IF('Crop Count'!$A22<>\"\",'Crop Count'!Q67,\"\")","v":""},{"$f":"IF('Crop Count'!$A22<>\"\",'Crop Count'!R67,\"\")","v":""},{"$f":"IF('Crop Count'!$A22<>\"\",'Crop Count'!S67,\"\")","v":""},{"$f":"IF('Crop Count'!$A22<>\"\",'Crop Count'!T67,\"\")","v":""},{"$f":"IF('Crop Count'!$A22<>\"\",'Crop Count'!U67,\"\")","v":""},{"$f":"IF('Crop Count'!$A22<>\"\",'Crop Count'!V67,\"\")","v":""},{"$f":"IF('Crop Count'!$A22<>\"\",'Crop Count'!W67,\"\")","v":""},{"$f":"IF('Crop Count'!$A22<>\"\",'Crop Count'!X67,\"\")","v":""},{"$f":"IF('Crop Count'!$A22<>\"\",'Crop Count'!Y67,\"\")","v":""},{"$f":"IF(AND('Crop Count'!$A22<>\"\",'Crop Count'!AC67<>\"\"),'Crop Count'!AC67,IF('Crop Count'!$A22<>\"\",'Crop Count'!AA67,\"\"))","v":""},{"$f":"IF('Crop Count'!$A22<>\"\",'Crop Count'!Z67,\"\")","v":""}," "]
[null,{"$f":"IF('Crop Count'!A23<>\"\",'Crop Count'!A23,\"\")","v":""},{"$f":"IF('Crop Count'!A23<>\"\",'Crop Count'!E23,IF(OR(AND(C30=\"Total Maximum Monthly Demand = \",C32=\"Total Annual Demand = \"),AND(C30=\"\",C32=\"\")),\"\",IF(AND(C30=\"\",C32=\"Total Maximum Monthly Demand = \"),\"Total Annual Demand = \",IF(OR(C30=\"Total Annual Demand = \",C30=\"\",C32<>\"\"),\"\",\"Total Maximum Monthly Demand = \"))))","v":""},null,null,null,null,{"$f":"IF('Crop Count'!A23<>\"\",'Crop Count'!G23,IF(C34=\"Total Maximum Monthly Demand = \",CONCATENATE('Crop Count'!$AI$30,'Crop Count'!$AI$31), IF(C34=\"Total Annual Demand = \",CONCATENATE('Crop Count'!$AJ$30,'Crop Count'!$AJ$31),\"\")))","v":""},null,null,{"$f":"IF('Crop Count'!A23<>\"\",'Crop Count'!H23,\"\")","v":""},null,{"$f":"IF('Crop Count'!A23<>\"\",'Crop Count'!B23,\"\")","v":""},null,{"$f":"IF('Crop Count'!A23<>\"\",'Crop Count'!C23,\"\")","v":""},{"$f":"IF('Crop Count'!A23<>\"\",'Crop Count'!D23,\"\")","v":""}]
[null,null,{"$f":"IF('Crop Count'!$A23<>\"\",'Crop Count'!N68,\"\")","v":""},{"$f":"IF('Crop Count'!$A23<>\"\",'Crop Count'!O68,\"\")","v":""},{"$f":"IF('Crop Count'!$A23<>\"\",'Crop Count'!P68,\"\")","v":""},{"$f":"IF('Crop Count'!$A23<>\"\",'Crop Count'!Q68,\"\")","v":""},{"$f":"IF('Crop Count'!$A23<>\"\",'Crop Count'!R68,\"\")","v":""},{"$f":"IF('Crop Count'!$A23<>\"\",'Crop Count'!S68,\"\")","v":""},{"$f":"IF('Crop Count'!$A23<>\"\",'Crop Count'!T68,\"\")","v":""},{"$f":"IF('Crop Count'!$A23<>\"\",'Crop Count'!U68,\"\")","v":""},{"$f":"IF('Crop Count'!$A23<>\"\",'Crop Count'!V68,\"\")","v":""},{"$f":"IF('Crop Count'!$A23<>\"\",'Crop Count'!W68,\"\")","v":""},{"$f":"IF('Crop Count'!$A23<>\"\",'Crop Count'!X68,\"\")","v":""},{"$f":"IF('Crop Count'!$A23<>\"\",'Crop Count'!Y68,\"\")","v":""},{"$f":"IF(AND('Crop Count'!$A23<>\"\",'Crop Count'!AC68<>\"\"),'Crop Count'!AC68,IF('Crop Count'!$A23<>\"\",'Crop Count'!AA68,\"\"))","v":""},{"$f":"IF('Crop Count'!$A23<>\"\",'Crop Count'!Z68,\"\")","v":""}," "]
[null,{"$f":"IF('Crop Count'!A24<>\"\",'Crop Count'!A24,\"\")","v":""},{"$f":"IF('Crop Count'!A24<>\"\",'Crop Count'!E24,IF(OR(AND(C32=\"Total Maximum Monthly Demand = \",C34=\"Total Annual Demand = \"),AND(C32=\"\",C34=\"\")),\"\",IF(AND(C32=\"\",C34=\"Total Maximum Monthly Demand = \"),\"Total Annual Demand = \",IF(OR(C32=\"Total Annual Demand = \",C32=\"\",C34<>\"\"),\"\",\"Total Maximum Monthly Demand = \"))))","v":""},null,null,null,null,{"$f":"IF('Crop Count'!A24<>\"\",'Crop Count'!G24,IF(C36=\"Total Maximum Monthly Demand = \",CONCATENATE('Crop Count'!$AI$30,'Crop Count'!$AI$31), IF(C36=\"Total Annual Demand = \",CONCATENATE('Crop Count'!$AJ$30,'Crop Count'!$AJ$31),\"\")))","v":""},null,null,{"$f":"IF('Crop Count'!A24<>\"\",'Crop Count'!H24,\"\")","v":""},null,{"$f":"IF('Crop Count'!A24<>\"\",'Crop Count'!B24,\"\")","v":""},null,{"$f":"IF('Crop Count'!A24<>\"\",'Crop Count'!C24,\"\")","v":""},{"$f":"IF('Crop Count'!A24<>\"\",'Crop Count'!D24,\"\")","v":""}]
[null,null,{"$f":"IF('Crop Count'!$A24<>\"\",'Crop Count'!N69,\"\")","v":""},{"$f":"IF('Crop Count'!$A24<>\"\",'Crop Count'!O69,\"\")","v":""},{"$f":"IF('Crop Count'!$A24<>\"\",'Crop Count'!P69,\"\")","v":""},{"$f":"IF('Crop Count'!$A24<>\"\",'Crop Count'!Q69,\"\")","v":""},{"$f":"IF('Crop Count'!$A24<>\"\",'Crop Count'!R69,\"\")","v":""},{"$f":"IF('Crop Count'!$A24<>\"\",'Crop Count'!S69,\"\")","v":""},{"$f":"IF('Crop Count'!$A24<>\"\",'Crop Count'!T69,\"\")","v":""},{"$f":"IF('Crop Count'!$A24<>\"\",'Crop Count'!U69,\"\")","v":""},{"$f":"IF('Crop Count'!$A24<>\"\",'Crop Count'!V69,\"\")","v":""},{"$f":"IF('Crop Count'!$A24<>\"\",'Crop Count'!W69,\"\")","v":""},{"$f":"IF('Crop Count'!$A24<>\"\",'Crop Count'!X69,\"\")","v":""},{"$f":"IF('Crop Count'!$A24<>\"\",'Crop Count'!Y69,\"\")","v":""},{"$f":"IF(AND('Crop Count'!$A24<>\"\",'Crop Count'!AC69<>\"\"),'Crop Count'!AC69,IF('Crop Count'!$A24<>\"\",'Crop Count'!AA69,\"\"))","v":""},{"$f":"IF('Crop Count'!$A24<>\"\",'Crop Count'!Z69,\"\")","v":""}," "]
[null,{"$f":"IF('Crop Count'!A25<>\"\",'Crop Count'!A25,\"\")","v":""},{"$f":"IF('Crop Count'!A25<>\"\",'Crop Count'!E25,IF(OR(AND(C34=\"Total Maximum Monthly Demand = \",C36=\"Total Annual Demand = \"),AND(C34=\"\",C36=\"\")),\"\",IF(AND(C34=\"\",C36=\"Total Maximum Monthly Demand = \"),\"Total Annual Demand = \",IF(OR(C34=\"Total Annual Demand = \",C34=\"\",C36<>\"\"),\"\",\"Total Maximum Monthly Demand = \"))))","v":""},null,null,null,null,{"$f":"IF('Crop Count'!A25<>\"\",'Crop Count'!G25,IF(C38=\"Total Maximum Monthly Demand = \",CONCATENATE('Crop Count'!$AI$30,'Crop Count'!$AI$31), IF(C38=\"Total Annual Demand = \",CONCATENATE('Crop Count'!$AJ$30,'Crop Count'!$AJ$31),\"\")))","v":""},null,null,{"$f":"IF('Crop Count'!A25<>\"\",'Crop Count'!H25,\"\")","v":""},null,{"$f":"IF('Crop Count'!A25<>\"\",'Crop Count'!B25,\"\")","v":""},null,{"$f":"IF('Crop Count'!A25<>\"\",'Crop Count'!C25,\"\")","v":""},{"$f":"IF('Crop Count'!A25<>\"\",'Crop Count'!D25,\"\")","v":""}]
[null,null,{"$f":"IF('Crop Count'!$A25<>\"\",'Crop Count'!N70,\"\")","v":""},{"$f":"IF('Crop Count'!$A25<>\"\",'Crop Count'!O70,\"\")","v":""},{"$f":"IF('Crop Count'!$A25<>\"\",'Crop Count'!P70,\"\")","v":""},{"$f":"IF('Crop Count'!$A25<>\"\",'Crop Count'!Q70,\"\")","v":""},{"$f":"IF('Crop Count'!$A25<>\"\",'Crop Count'!R70,\"\")","v":""},{"$f":"IF('Crop Count'!$A25<>\"\",'Crop Count'!S70,\"\")","v":""},{"$f":"IF('Crop Count'!$A25<>\"\",'Crop Count'!T70,\"\")","v":""},{"$f":"IF('Crop Count'!$A25<>\"\",'Crop Count'!U70,\"\")","v":""},{"$f":"IF('Crop Count'!$A25<>\"\",'Crop Count'!V70,\"\")","v":""},{"$f":"IF('Crop Count'!$A25<>\"\",'Crop Count'!W70,\"\")","v":""},{"$f":"IF('Crop Count'!$A25<>\"\",'Crop Count'!X70,\"\")","v":""},{"$f":"IF('Crop Count'!$A25<>\"\",'Crop Count'!Y70,\"\")","v":""},{"$f":"IF(AND('Crop Count'!$A25<>\"\",'Crop Count'!AC70<>\"\"),'Crop Count'!AC70,IF('Crop Count'!$A25<>\"\",'Crop Count'!AA70,\"\"))","v":""},{"$f":"IF('Crop Count'!$A25<>\"\",'Crop Count'!Z70,\"\")","v":""}," "]
[null,{"$f":"IF('Crop Count'!A26<>\"\",'Crop Count'!A26,\"\")","v":""},{"$f":"IF('Crop Count'!A26<>\"\",'Crop Count'!E26,IF(OR(AND(C36=\"Total Maximum Monthly Demand = \",C38=\"Total Annual Demand = \"),AND(C36=\"\",C38=\"\")),\"\",IF(AND(C36=\"\",C38=\"Total Maximum Monthly Demand = \"),\"Total Annual Demand = \",IF(OR(C36=\"Total Annual Demand = \",C36=\"\",C38<>\"\"),\"\",\"Total Maximum Monthly Demand = \"))))","v":""},null,null,null,null,{"$f":"IF('Crop Count'!A26<>\"\",'Crop Count'!G26,IF(C40=\"Total Maximum Monthly Demand = \",CONCATENATE('Crop Count'!$AI$30,'Crop Count'!$AI$31), IF(C40=\"Total Annual Demand = \",CONCATENATE('Crop Count'!$AJ$30,'Crop Count'!$AJ$31),\"\")))","v":""},null,null,{"$f":"IF('Crop Count'!A26<>\"\",'Crop Count'!H26,\"\")","v":""},null,{"$f":"IF('Crop Count'!A26<>\"\",'Crop Count'!B26,\"\")","v":""},null,{"$f":"IF('Crop Count'!A26<>\"\",'Crop Count'!C26,\"\")","v":""},{"$f":"IF('Crop Count'!A26<>\"\",'Crop Count'!D26,\"\")","v":""}]
[null,null,{"$f":"IF('Crop Count'!$A26<>\"\",'Crop Count'!N71,\"\")","v":""},{"$f":"IF('Crop Count'!$A26<>\"\",'Crop Count'!O71,\"\")","v":""},{"$f":"IF('Crop Count'!$A26<>\"\",'Crop Count'!P71,\"\")","v":""},{"$f":"IF('Crop Count'!$A26<>\"\",'Crop Count'!Q71,\"\")","v":""},{"$f":"IF('Crop Count'!$A26<>\"\",'Crop Count'!R71,\"\")","v":""},{"$f":"IF('Crop Count'!$A26<>\"\",'Crop Count'!S71,\"\")","v":""},{"$f":"IF('Crop Count'!$A26<>\"\",'Crop Count'!T71,\"\")","v":""},{"$f":"IF('Crop Count'!$A26<>\"\",'Crop Count'!U71,\"\")","v":""},{"$f":"IF('Crop Count'!$A26<>\"\",'Crop Count'!V71,\"\")","v":""},{"$f":"IF('Crop Count'!$A26<>\"\",'Crop Count'!W71,\"\")","v":""},{"$f":"IF('Crop Count'!$A26<>\"\",'Crop Count'!X71,\"\")","v":""},{"$f":"IF('Crop Count'!$A26<>\"\",'Crop Count'!Y71,\"\")","v":""},{"$f":"IF(AND('Crop Count'!$A26<>\"\",'Crop Count'!AC71<>\"\"),'Crop Count'!AC71,IF('Crop Count'!$A26<>\"\",'Crop Count'!AA71,\"\"))","v":""},{"$f":"IF('Crop Count'!$A26<>\"\",'Crop Count'!Z71,\"\")","v":""}," "]
[null,{"$f":"IF('Crop Count'!A27<>\"\",'Crop Count'!A27,\"\")","v":""},{"$f":"IF('Crop Count'!A27<>\"\",'Crop Count'!E27,IF(OR(AND(C38=\"Total Maximum Monthly Demand = \",C40=\"Total Annual Demand = \"),AND(C38=\"\",C40=\"\")),\"\",IF(AND(C38=\"\",C40=\"Total Maximum Monthly Demand = \"),\"Total Annual Demand = \",IF(OR(C38=\"Total Annual Demand = \",C38=\"\",C40<>\"\"),\"\",\"Total Maximum Monthly Demand = \"))))","v":""},null,null,null,null,{"$f":"IF('Crop Count'!A27<>\"\",'Crop Count'!G27,IF(C42=\"Total Maximum Monthly Demand = \",CONCATENATE('Crop Count'!$AI$30,'Crop Count'!$AI$31), IF(C42=\"Total Annual Demand = \",CONCATENATE('Crop Count'!$AJ$30,'Crop Count'!$AJ$31),\"\")))","v":""},null,null,{"$f":"IF('Crop Count'!A27<>\"\",'Crop Count'!H27,\"\")","v":""},null,{"$f":"IF('Crop Count'!A27<>\"\",'Crop Count'!B27,\"\")","v":""},null,{"$f":"IF('Crop Count'!A27<>\"\",'Crop Count'!C27,\"\")","v":""},{"$f":"IF('Crop Count'!A27<>\"\",'Crop Count'!D27,\"\")","v":""}]
[null,null,{"$f":"IF('Crop Count'!$A27<>\"\",'Crop Count'!N72,\"\")","v":""},{"$f":"IF('Crop Count'!$A27<>\"\",'Crop Count'!O72,\"\")","v":""},{"$f":"IF('Crop Count'!$A27<>\"\",'Crop Count'!P72,\"\")","v":""},{"$f":"IF('Crop Count'!$A27<>\"\",'Crop Count'!Q72,\"\")","v":""},{"$f":"IF('Crop Count'!$A27<>\"\",'Crop Count'!R72,\"\")","v":""},{"$f":"IF('Crop Count'!$A27<>\"\",'Crop Count'!S72,\"\")","v":""},{"$f":"IF('Crop Count'!$A27<>\"\",'Crop Count'!T72,\"\")","v":""},{"$f":"IF('Crop Count'!$A27<>\"\",'Crop Count'!U72,\"\")","v":""},{"$f":"IF('Crop Count'!$A27<>\"\",'Crop Count'!V72,\"\")","v":""},{"$f":"IF('Crop Count'!$A27<>\"\",'Crop Count'!W72,\"\")","v":""},{"$f":"IF('Crop Count'!$A27<>\"\",'Crop Count'!X72,\"\")","v":""},{"$f":"IF('Crop Count'!$A27<>\"\",'Crop Count'!Y72,\"\")","v":""},{"$f":"IF(AND('Crop Count'!$A27<>\"\",'Crop Count'!AC72<>\"\"),'Crop Count'!AC72,IF('Crop Count'!$A27<>\"\",'Crop Count'!AA72,\"\"))","v":""},{"$f":"IF('Crop Count'!$A27<>\"\",'Crop Count'!Z72,\"\")","v":""}," "]
[null,{"$f":"IF('Crop Count'!A28<>\"\",'Crop Count'!A28,\"\")","v":""},{"$f":"IF('Crop Count'!A28<>\"\",'Crop Count'!E28,IF(OR(AND(C40=\"Total Maximum Monthly Demand = \",C42=\"Total Annual Demand = \"),AND(C40=\"\",C42=\"\")),\"\",IF(AND(C40=\"\",C42=\"Total Maximum Monthly Demand = \"),\"Total Annual Demand = \",IF(OR(C40=\"Total Annual Demand = \",C40=\"\",C42<>\"\"),\"\",\"Total Maximum Monthly Demand = \"))))","v":""},null,null,null,null,{"$f":"IF('Crop Count'!A28<>\"\",'Crop Count'!G28,IF(C44=\"Total Maximum Monthly Demand = \",CONCATENATE('Crop Count'!$AI$30,'Crop Count'!$AI$31), IF(C44=\"Total Annual Demand = \",CONCATENATE('Crop Count'!$AJ$30,'Crop Count'!$AJ$31),\"\")))","v":""},null,null,{"$f":"IF('Crop Count'!A28<>\"\",'Crop Count'!H28,\"\")","v":""},null,{"$f":"IF('Crop Count'!A28<>\"\",'Crop Count'!B28,\"\")","v":""},null,{"$f":"IF('Crop Count'!A28<>\"\",'Crop Count'!C28,\"\")","v":""},{"$f":"IF('Crop Count'!A28<>\"\",'Crop Count'!D28,\"\")","v":""}]
[null,null,{"$f":"IF('Crop Count'!$A28<>\"\",'Crop Count'!N73,\"\")","v":""},{"$f":"IF('Crop Count'!$A28<>\"\",'Crop Count'!O73,\"\")","v":""},{"$f":"IF('Crop Count'!$A28<>\"\",'Crop Count'!P73,\"\")","v":""},{"$f":"IF('Crop Count'!$A28<>\"\",'Crop Count'!Q73,\"\")","v":""},{"$f":"IF('Crop Count'!$A28<>\"\",'Crop Count'!R73,\"\")","v":""},{"$f":"IF('Crop Count'!$A28<>\"\",'Crop Count'!S73,\"\")","v":""},{"$f":"IF('Crop Count'!$A28<>\"\",'Crop Count'!T73,\"\")","v":""},{"$f":"IF('Crop Count'!$A28<>\"\",'Crop Count'!U73,\"\")","v":""},{"$f":"IF('Crop Count'!$A28<>\"\",'Crop Count'!V73,\"\")","v":""},{"$f":"IF('Crop Count'!$A28<>\"\",'Crop Count'!W73,\"\")","v":""},{"$f":"IF('Crop Count'!$A28<>\"\",'Crop Count'!X73,\"\")","v":""},{"$f":"IF('Crop Count'!$A28<>\"\",'Crop Count'!Y73,\"\")","v":""},{"$f":"IF(AND('Crop Count'!$A28<>\"\",'Crop Count'!AC73<>\"\"),'Crop Count'!AC73,IF('Crop Count'!$A28<>\"\",'Crop Count'!AA73,\"\"))","v":""},{"$f":"IF('Crop Count'!$A28<>\"\",'Crop Count'!Z73,\"\")","v":""}," "]
[null,{"$f":"IF('Crop Count'!A29<>\"\",'Crop Count'!A29,\"\")","v":""},{"$f":"IF('Crop Count'!A29<>\"\",'Crop Count'!E29,IF(OR(AND(C40=\"Total Maximum Monthly Demand = \",C42=\"Total Annual Demand = \"),AND(C40=\"\",C42=\"\")),\"\",IF(AND(C40=\"\",C42=\"Total Maximum Monthly Demand = \"),\"Total Annual Demand = \",IF(OR(C42=\"Total Annual Demand = \",C42=\"\",C44<>\"\"),\"\",\"Total Maximum Monthly Demand = \"))))","v":""},null,null,null,null,{"$f":"IF('Crop Count'!A29<>\"\",'Crop Count'!G29,IF(C46=\"Total Maximum Monthly Demand = \",CONCATENATE('Crop Count'!$AI$30,'Crop Count'!$AI$31), IF(C46=\"Total Annual Demand = \",CONCATENATE('Crop Count'!$AJ$30,'Crop Count'!$AJ$31),\"\")))","v":""},null,null,{"$f":"IF('Crop Count'!A29<>\"\",'Crop Count'!H29,\"\")","v":""},null,{"$f":"IF('Crop Count'!A29<>\"\",'Crop Count'!B29,\"\")","v":""},null,{"$f":"IF('Crop Count'!A29<>\"\",'Crop Count'!C29,\"\")","v":""},{"$f":"IF('Crop Count'!A29<>\"\",'Crop Count'!D29,\"\")","v":""}]
[null,null,{"$f":"IF('Crop Count'!$A29<>\"\",'Crop Count'!N74,\"\")","v":""},{"$f":"IF('Crop Count'!$A29<>\"\",'Crop Count'!O74,\"\")","v":""},{"$f":"IF('Crop Count'!$A29<>\"\",'Crop Count'!P74,\"\")","v":""},{"$f":"IF('Crop Count'!$A29<>\"\",'Crop Count'!Q74,\"\")","v":""},{"$f":"IF('Crop Count'!$A29<>\"\",'Crop Count'!R74,\"\")","v":""},{"$f":"IF('Crop Count'!$A29<>\"\",'Crop Count'!S74,\"\")","v":""},{"$f":"IF('Crop Count'!$A29<>\"\",'Crop Count'!T74,\"\")","v":""},{"$f":"IF('Crop Count'!$A29<>\"\",'Crop Count'!U74,\"\")","v":""},{"$f":"IF('Crop Count'!$A29<>\"\",'Crop Count'!V74,\"\")","v":""},{"$f":"IF('Crop Count'!$A29<>\"\",'Crop Count'!W74,\"\")","v":""},{"$f":"IF('Crop Count'!$A29<>\"\",'Crop Count'!X74,\"\")","v":""},{"$f":"IF('Crop Count'!$A29<>\"\",'Crop Count'!Y74,\"\")","v":""},{"$f":"IF(AND('Crop Count'!$A29<>\"\",'Crop Count'!AC74<>\"\"),'Crop Count'!AC74,IF('Crop Count'!$A29<>\"\",'Crop Count'!AA74,\"\"))","v":""},{"$f":"IF('Crop Count'!$A29<>\"\",'Crop Count'!Z74,\"\")","v":""}," "]
[]
[]
[null,null,{"$f":"IF('Crop Count'!A29<>\"\",\"Total Maximum Monthly Demand = \",\"\")","v":""},null,null,null,null,{"$f":"IF('Crop Count'!A29<>\"\",CONCATENATE('Crop Count'!$AI$30,'Crop Count'!$AI$31),\"\")","v":""}]
[]
[null,null,{"$f":"IF('Crop Count'!A29<>\"\",\"Total Annual Demand = \",\"\")","v":""},null,null,null,null,{"$f":"IF('Crop Count'!A29<>\"\",CONCATENATE('Crop Count'!$AJ$30,'Crop Count'!$AJ$31),\"\")","v":""}]
[null,null,null,null,null,null,null,null,null,null,null,null,{"$f":"CONCATENATE(\"EXHIBIT \",Input2!N11)","v":"EXHIBIT "}]

{"sheet":"Blaney Calc","index":6,"n_rows":34,"n_cols":16,"rows_kept":34,"cut":false,"hidden":true,"merged":[[0,0,0,1],[21,10,21,11],[19,3,19,4]]}
[{"$f":"IF(InputControl!$B$12=2,\"2-in-10 Data Input\",\"1-in-10 Data Input\")","v":"1-in-10 Data Input"},null,{"$f":"IF(InputControl!$B$12=2,OFFSET('climo data'!$A$2,0,(InputControl!$B$17*4)-4),OFFSET('climo data'!$A$21,0,(InputControl!$B$17*4)-4))","v":"Okeechobee"},null,null,{"$f":"IF(InputControl!$B$57<50,VLOOKUP(\"b\",'crop k''s'!$A$2:$Q$3,'crop k''s'!D104,FALSE),VLOOKUP(\"b\",'crop k''s'!$A$18:$U$19,'crop k''s'!D104,FALSE))","v":"Nursery"},"Calculate et and effective average rain"]
["rain",{"$f":"IF(InputControl!$B$12=2,\"2-in-10 Rainfall (inches)\",\"1-in-10 Rainfall (inches)\")","v":"1-in-10 Rainfall (inches)"},"Temp","sun","Soil","coeff","F(M) (5)","AKT(M)(6)","AKTF(M)(7)","U(M) (8)","RT1(M)(9)","U1(M) (10)","F1          (11)","RE(M) (12)",{"$f":"IF(InputControl!$B$12=2,\"(7)       2-in-10\",\"(7)       1-in-10\")","v":"(7)       1-in-10"},{"$f":"IF(InputControl!$B$12=2,\"(10)      2-in-10\",\"(10)      1-in-10\")","v":"(10)      1-in-10"}]
[]
[{"$f":"IF(InputControl!$B$12=2,OFFSET('climo data'!A4,0,(InputControl!$B$17*4)-4),OFFSET('climo data'!A23,0,(InputControl!$B$17*4)-4))","v":1.76},{"$f":"IF(InputControl!$B$12=2,ROUND((OFFSET('climo data'!A4,0,(InputControl!$B$17*4)-4)*OFFSET('climo data'!$A$17,0,(InputControl!$B$17*4)-2)),2),ROUND((OFFSET('climo data'!A23,0,(InputControl!$B$17*4)-4)*OFFSET('climo data'!$A$36,0,(InputControl!$B$17*4)-2)),2))","v":1.44},{"$f":"IF(InputControl!$B$12=2,OFFSET('climo data'!A4,0,(InputControl!$B$17*4)-2),OFFSET('climo data'!A23,0,(InputControl!$B$17*4)-2))","v":62.03},{"$f":"IF(InputControl!$B$12=2,OFFSET('climo data'!A4,0,(InputControl!$B$17*4)-1),OFFSET('climo data'!A23,0,(InputControl!$B$17*4)-1))","v":7.43},{"$f":"InputControl!$B$127","v":0.8},{"$f":"IF(InputControl!$B$57<50,VLOOKUP(\"a\",'crop k''s'!$A$4:$Q$15,'crop k''s'!$D$104,FALSE),'crop k''s'!P69)","v":0.49},{"$f":"(C4*D4)/100","v":4.6088290000000001},{"$f":"(0.0173*C4)-0.314","v":0.75911899999999999},{"$f":"(G4*H4)","v":3.49865},{"$f":"(I4*F4)","v":1.7143390000000001},{"$f":"(0.70917*(A4^0.82416)-0.11556)","v":1.014475},{"$f":"10^(0.02426*J4)","v":1.1005},{"$f":"0.531747+(0.295154*$E$4)-(0.057697*$E$4^2)+(0.003804*$E$4^3)","v":0.73289199999999999},{"$f":"(K4*L4*M4)","v":0.818222},{"$f":"IF(InputControl!$B$12=2,(0.70917*(A4^0.82416)-0.11556),(0.70917*(A4^0.82416)-0.11556))","v":1.014475},{"$f":"IF(InputControl!$B$12=2,(O4*L4*M4)*OFFSET('climo data'!$C$17,0,(InputControl!$B$17*4)-4),(O4*L4*M4)*OFFSET('climo data'!$C$36,0,(InputControl!$B$17*4)-4))","v":0.67094200000000004}]
[{"$f":"IF(InputControl!$B$12=2,OFFSET('climo data'!A5,0,(InputControl!$B$17*4)-4),OFFSET('climo data'!A24,0,(InputControl!$B$17*4)-4))","v":2.19},{"$f":"IF(InputControl!$B$12=2,ROUND((OFFSET('climo data'!A5,0,(InputControl!$B$17*4)-4)*OFFSET('climo data'!$A$17,0,(InputControl!$B$17*4)-2)),2),ROUND((OFFSET('climo data'!A24,0,(InputControl!$B$17*4)-4)*OFFSET('climo data'!$A$36,0,(InputControl!$B$17*4)-2)),2))","v":1.8},{"$f":"IF(InputControl!$B$12=2,OFFSET('climo data'!A5,0,(InputControl!$B$17*4)-2),OFFSET('climo data'!A24,0,(InputControl!$B$17*4)-2))","v":63.93},{"$f":"IF(InputControl!$B$12=2,OFFSET('climo data'!A5,0,(InputControl!$B$17*4)-1),OFFSET('climo data'!A24,0,(InputControl!$B$17*4)-1))","v":7.09},null,{"$f":"IF(InputControl!$B$57<50,VLOOKUP(\"b\",'crop k''s'!$A$4:$Q$15,'crop k''s'!$D$104,FALSE),'crop k''s'!P70)","v":0.56999999999999995},4.5326370000000002,0.79198900000000005,3.5897990000000002,2.0461849999999999,1.2375430000000001,1.1210899999999999,{"$f":"0.531747+(0.295154*$E$4)-(0.057697*$E$4^2)+(0.003804*$E$4^3)","v":0.73289199999999999},1.016812,{"$f":"IF(InputControl!$B$12=2,(0.70917*(A5^0.82416)-0.11556),(0.70917*(A5^0.82416)-0.11556))","v":1.2375430000000001},{"$f":"IF(InputControl!$B$12=2,(O5*L5*M5)*OFFSET('climo data'!$C$17,0,(InputControl!$B$17*4)-4),(O5*L5*M5)*OFFSET('climo data'!$C$36,0,(InputControl!$B$17*4)-4))","v":0.83378600000000003}]
[{"$f":"IF(InputControl!$B$12=2,OFFSET('climo data'!A6,0,(InputControl!$B$17*4)-4),OFFSET('climo data'!A25,0,(InputControl!$B$17*4)-4))","v":2.89},{"$f":"IF(InputControl!$B$12=2,ROUND((OFFSET('climo data'!A6,0,(InputControl!$B$17*4)-4)*OFFSET('climo data'!$A$17,0,(InputControl!$B$17*4)-2)),2),ROUND((OFFSET('climo data'!A25,0,(InputControl!$B$17*4)-4)*OFFSET('climo data'!$A$36,0,(InputControl!$B$17*4)-2)),2))","v":2.37},{"$f":"IF(InputControl!$B$12=2,OFFSET('climo data'!A6,0,(InputControl!$B$17*4)-2),OFFSET('climo data'!A25,0,(InputControl!$B$17*4)-2))","v":67.84},{"$f":"IF(InputControl!$B$12=2,OFFSET('climo data'!A6,0,(InputControl!$B$17*4)-1),OFFSET('climo data'!A25,0,(InputControl!$B$17*4)-1))","v":8.3800000000000008},null,{"$f":"IF(InputControl!$B$57<50,VLOOKUP(\"c\",'crop k''s'!$A$4:$Q$15,'crop k''s'!$D$104,FALSE),'crop k''s'!P71)","v":0.73},5.6849920000000003,0.85963199999999995,4.8870009999999997,3.5675110000000001,1.5850470000000001,1.2205280000000001,0.73289199999999999,1.4178489999999999,{"$f":"IF(InputControl!$B$12=2,(0.70917*(A6^0.82416)-0.11556),(0.70917*(A6^0.82416)-0.11556))","v":1.5850470000000001},{"$f":"IF(InputControl!$B$12=2,(O6*L6*M6)*OFFSET('climo data'!$C$17,0,(InputControl!$B$17*4)-4),(O6*L6*M6)*OFFSET('climo data'!$C$36,0,(InputControl!$B$17*4)-4))","v":1.162636}]
[{"$f":"IF(InputControl!$B$12=2,OFFSET('climo data'!A7,0,(InputControl!$B$17*4)-4),OFFSET('climo data'!A26,0,(InputControl!$B$17*4)-4))","v":2.78},{"$f":"IF(InputControl!$B$12=2,ROUND((OFFSET('climo data'!A7,0,(InputControl!$B$17*4)-4)*OFFSET('climo data'!$A$17,0,(InputControl!$B$17*4)-2)),2),ROUND((OFFSET('climo data'!A26,0,(InputControl!$B$17*4)-4)*OFFSET('climo data'!$A$36,0,(InputControl!$B$17*4)-2)),2))","v":2.2799999999999998},{"$f":"IF(InputControl!$B$12=2,OFFSET('climo data'!A7,0,(InputControl!$B$17*4)-2),OFFSET('climo data'!A26,0,(InputControl!$B$17*4)-2))","v":72.13},{"$f":"IF(InputControl!$B$12=2,OFFSET('climo data'!A7,0,(InputControl!$B$17*4)-1),OFFSET('climo data'!A26,0,(InputControl!$B$17*4)-1))","v":8.66},null,{"$f":"IF(InputControl!$B$57<50,VLOOKUP(\"d\",'crop k''s'!$A$4:$Q$15,'crop k''s'!$D$104,FALSE),'crop k''s'!P72)","v":0.85},6.2464579999999996,0.93384900000000004,5.8332490000000004,4.9582620000000004,1.5315190000000001,1.3191299999999999,0.73289199999999999,1.480642,{"$f":"IF(InputControl!$B$12=2,(0.70917*(A7^0.82416)-0.11556),(0.70917*(A7^0.82416)-0.11556))","v":1.5315190000000001},{"$f":"IF(InputControl!$B$12=2,(O7*L7*M7)*OFFSET('climo data'!$C$17,0,(InputControl!$B$17*4)-4),(O7*L7*M7)*OFFSET('climo data'!$C$36,0,(InputControl!$B$17*4)-4))","v":1.214126}]
[{"$f":"IF(InputControl!$B$12=2,OFFSET('climo data'!A8,0,(InputControl!$B$17*4)-4),OFFSET('climo data'!A27,0,(InputControl!$B$17*4)-4))","v":4.29},{"$f":"IF(InputControl!$B$12=2,ROUND((OFFSET('climo data'!A8,0,(InputControl!$B$17*4)-4)*OFFSET('climo data'!$A$17,0,(InputControl!$B$17*4)-2)),2),ROUND((OFFSET('climo data'!A27,0,(InputControl!$B$17*4)-4)*OFFSET('climo data'!$A$36,0,(InputControl!$B$17*4)-2)),2))","v":3.52},{"$f":"IF(InputControl!$B$12=2,OFFSET('climo data'!A8,0,(InputControl!$B$17*4)-2),OFFSET('climo data'!A27,0,(InputControl!$B$17*4)-2))","v":76.81},{"$f":"IF(InputControl!$B$12=2,OFFSET('climo data'!A8,0,(InputControl!$B$17*4)-1),OFFSET('climo data'!A27,0,(InputControl!$B$17*4)-1))","v":9.42},null,{"$f":"IF(InputControl!$B$57<50,VLOOKUP(\"e\",'crop k''s'!$A$4:$Q$15,'crop k''s'!$D$104,FALSE),'crop k''s'!P73)","v":0.9},7.2355020000000003,1.014813,7.3426809999999998,6.6084129999999996,2.2394699999999998,1.4465060000000001,0.73289199999999999,2.3741349999999999,{"$f":"IF(InputControl!$B$12=2,(0.70917*(A8^0.82416)-0.11556),(0.70917*(A8^0.82416)-0.11556))","v":2.2394699999999998},{"$f":"IF(InputControl!$B$12=2,(O8*L8*M8)*OFFSET('climo data'!$C$17,0,(InputControl!$B$17*4)-4),(O8*L8*M8)*OFFSET('climo data'!$C$36,0,(InputControl!$B$17*4)-4))","v":1.9467909999999999}]
[{"$f":"IF(InputControl!$B$12=2,OFFSET('climo data'!A9,0,(InputControl!$B$17*4)-4),OFFSET('climo data'!A28,0,(InputControl!$B$17*4)-4))","v":7.35},{"$f":"IF(InputControl!$B$12=2,ROUND((OFFSET('climo data'!A9,0,(InputControl!$B$17*4)-4)*OFFSET('climo data'!$A$17,0,(InputControl!$B$17*4)-2)),2),ROUND((OFFSET('climo data'!A28,0,(InputControl!$B$17*4)-4)*OFFSET('climo data'!$A$36,0,(InputControl!$B$17*4)-2)),2))","v":6.03},{"$f":"IF(InputControl!$B$12=2,OFFSET('climo data'!A9,0,(InputControl!$B$17*4)-2),OFFSET('climo data'!A28,0,(InputControl!$B$17*4)-2))","v":80.17},{"$f":"IF(InputControl!$B$12=2,OFFSET('climo data'!A9,0,(InputControl!$B$17*4)-1),OFFSET('climo data'!A28,0,(InputControl!$B$17*4)-1))","v":9.35},null,{"$f":"IF(InputControl!$B$57<50,VLOOKUP(\"f\",'crop k''s'!$A$4:$Q$15,'crop k''s'!$D$104,FALSE),'crop k''s'!P74)","v":0.92},7.495895,1.0729409999999999,8.0426529999999996,7.399241,3.5548090000000001,1.5118389999999999,0.73289199999999999,3.9387810000000001,{"$f":"IF(InputControl!$B$12=2,(0.70917*(A9^0.82416)-0.11556),(0.70917*(A9^0.82416)-0.11556))","v":3.5548090000000001},{"$f":"IF(InputControl!$B$12=2,(O9*L9*M9)*OFFSET('climo data'!$C$17,0,(InputControl!$B$17*4)-4),(O9*L9*M9)*OFFSET('climo data'!$C$36,0,(InputControl!$B$17*4)-4))","v":3.2298}]
[{"$f":"IF(InputControl!$B$12=2,OFFSET('climo data'!A10,0,(InputControl!$B$17*4)-4),OFFSET('climo data'!A29,0,(InputControl!$B$17*4)-4))","v":6.55},{"$f":"IF(InputControl!$B$12=2,ROUND((OFFSET('climo data'!A10,0,(InputControl!$B$17*4)-4)*OFFSET('climo data'!$A$17,0,(InputControl!$B$17*4)-2)),2),ROUND((OFFSET('climo data'!A29,0,(InputControl!$B$17*4)-4)*OFFSET('climo data'!$A$36,0,(InputControl!$B$17*4)-2)),2))","v":5.37},{"$f":"IF(InputControl!$B$12=2,OFFSET('climo data'!A10,0,(InputControl!$B$17*4)-2),OFFSET('climo data'!A29,0,(InputControl!$B$17*4)-2))","v":81.61},{"$f":"IF(InputControl!$B$12=2,OFFSET('climo data'!A10,0,(InputControl!$B$17*4)-1),OFFSET('climo data'!A29,0,(InputControl!$B$17*4)-1))","v":9.5399999999999991},null,{"$f":"IF(InputControl!$B$57<50,VLOOKUP(\"g\",'crop k''s'!$A$4:$Q$15,'crop k''s'!$D$104,FALSE),'crop k''s'!P75)","v":0.92},7.7855939999999997,1.097853,8.5474379999999996,7.8636429999999997,3.222267,1.551572,0.73289199999999999,3.6641520000000001,{"$f":"IF(InputControl!$B$12=2,(0.70917*(A10^0.82416)-0.11556),(0.70917*(A10^0.82416)-0.11556))","v":3.222267},{"$f":"IF(InputControl!$B$12=2,(O10*L10*M10)*OFFSET('climo data'!$C$17,0,(InputControl!$B$17*4)-4),(O10*L10*M10)*OFFSET('climo data'!$C$36,0,(InputControl!$B$17*4)-4))","v":3.0046040000000001}]
[{"$f":"IF(InputControl!$B$12=2,OFFSET('climo data'!A11,0,(InputControl!$B$17*4)-4),OFFSET('climo data'!A30,0,(InputControl!$B$17*4)-4))","v":6.65},{"$f":"IF(InputControl!$B$12=2,ROUND((OFFSET('climo data'!A11,0,(InputControl!$B$17*4)-4)*OFFSET('climo data'!$A$17,0,(InputControl!$B$17*4)-2)),2),ROUND((OFFSET('climo data'!A30,0,(InputControl!$B$17*4)-4)*OFFSET('climo data'!$A$36,0,(InputControl!$B$17*4)-2)),2))","v":5.45},{"$f":"IF(InputControl!$B$12=2,OFFSET('climo data'!A11,0,(InputControl!$B$17*4)-2),OFFSET('climo data'!A30,0,(InputControl!$B$17*4)-2))","v":81.709999999999994},{"$f":"IF(InputControl!$B$12=2,OFFSET('climo data'!A11,0,(InputControl!$B$17*4)-1),OFFSET('climo data'!A30,0,(InputControl!$B$17*4)-1))","v":9.15},null,{"$f":"IF(InputControl!$B$57<50,VLOOKUP(\"h\",'crop k''s'!$A$4:$Q$15,'crop k''s'!$D$104,FALSE),'crop k''s'!P76)","v":0.91},7.4764650000000001,1.099583,8.2209939999999992,7.4811050000000003,3.2642090000000001,1.518769,0.73289199999999999,3.6333700000000002,{"$f":"IF(InputControl!$B$12=2,(0.70917*(A11^0.82416)-0.11556),(0.70917*(A11^0.82416)-0.11556))","v":3.2642090000000001},{"$f":"IF(InputControl!$B$12=2,(O11*L11*M11)*OFFSET('climo data'!$C$17,0,(InputControl!$B$17*4)-4),(O11*L11*M11)*OFFSET('climo data'!$C$36,0,(InputControl!$B$17*4)-4))","v":2.9793639999999999}]
[{"$f":"IF(InputControl!$B$12=2,OFFSET('climo data'!A12,0,(InputControl!$B$17*4)-4),OFFSET('climo data'!A31,0,(InputControl!$B$17*4)-4))","v":6.37},{"$f":"IF(InputControl!$B$12=2,ROUND((OFFSET('climo data'!A12,0,(InputControl!$B$17*4)-4)*OFFSET('climo data'!$A$17,0,(InputControl!$B$17*4)-2)),2),ROUND((OFFSET('climo data'!A31,0,(InputControl!$B$17*4)-4)*OFFSET('climo data'!$A$36,0,(InputControl!$B$17*4)-2)),2))","v":5.22},{"$f":"IF(InputControl!$B$12=2,OFFSET('climo data'!A12,0,(InputControl!$B$17*4)-2),OFFSET('climo data'!A31,0,(InputControl!$B$17*4)-2))","v":80.47},{"$f":"IF(InputControl!$B$12=2,OFFSET('climo data'!A12,0,(InputControl!$B$17*4)-1),OFFSET('climo data'!A31,0,(InputControl!$B$17*4)-1))","v":8.32},null,{"$f":"IF(InputControl!$B$57<50,VLOOKUP(\"i\",'crop k''s'!$A$4:$Q$15,'crop k''s'!$D$104,FALSE),'crop k''s'!P77)","v":0.87},6.6951039999999997,1.078131,7.2181990000000003,6.279833,3.1464850000000002,1.4201980000000001,0.73289199999999999,3.2750240000000002,{"$f":"IF(InputControl!$B$12=2,(0.70917*(A12^0.82416)-0.11556),(0.70917*(A12^0.82416)-0.11556))","v":3.1464850000000002},{"$f":"IF(InputControl!$B$12=2,(O12*L12*M12)*OFFSET('climo data'!$C$17,0,(InputControl!$B$17*4)-4),(O12*L12*M12)*OFFSET('climo data'!$C$36,0,(InputControl!$B$17*4)-4))","v":2.6855199999999999}]
[{"$f":"IF(InputControl!$B$12=2,OFFSET('climo data'!A13,0,(InputControl!$B$17*4)-4),OFFSET('climo data'!A32,0,(InputControl!$B$17*4)-4))","v":4.0999999999999996},{"$f":"IF(InputControl!$B$12=2,ROUND((OFFSET('climo data'!A13,0,(InputControl!$B$17*4)-4)*OFFSET('climo data'!$A$17,0,(InputControl!$B$17*4)-2)),2),ROUND((OFFSET('climo data'!A32,0,(InputControl!$B$17*4)-4)*OFFSET('climo data'!$A$36,0,(InputControl!$B$17*4)-2)),2))","v":3.36},{"$f":"IF(InputControl!$B$12=2,OFFSET('climo data'!A13,0,(InputControl!$B$17*4)-2),OFFSET('climo data'!A32,0,(InputControl!$B$17*4)-2))","v":75.349999999999994},{"$f":"IF(InputControl!$B$12=2,OFFSET('climo data'!A13,0,(InputControl!$B$17*4)-1),OFFSET('climo data'!A32,0,(InputControl!$B$17*4)-1))","v":8.0399999999999991},null,{"$f":"IF(InputControl!$B$57<50,VLOOKUP(\"j\",'crop k''s'!$A$4:$Q$15,'crop k''s'!$D$104,FALSE),'crop k''s'!P78)","v":0.79},6.0581399999999999,0.98955499999999996,5.9948629999999996,4.7359419999999997,2.1531669999999998,1.3028489999999999,0.73289199999999999,2.0559460000000001,{"$f":"IF(InputControl!$B$12=2,(0.70917*(A13^0.82416)-0.11556),(0.70917*(A13^0.82416)-0.11556))","v":2.1531669999999998},{"$f":"IF(InputControl!$B$12=2,(O13*L13*M13)*OFFSET('climo data'!$C$17,0,(InputControl!$B$17*4)-4),(O13*L13*M13)*OFFSET('climo data'!$C$36,0,(InputControl!$B$17*4)-4))","v":1.6858759999999999}]
[{"$f":"IF(InputControl!$B$12=2,OFFSET('climo data'!A14,0,(InputControl!$B$17*4)-4),OFFSET('climo data'!A33,0,(InputControl!$B$17*4)-4))","v":1.91},{"$f":"IF(InputControl!$B$12=2,ROUND((OFFSET('climo data'!A14,0,(InputControl!$B$17*4)-4)*OFFSET('climo data'!$A$17,0,(InputControl!$B$17*4)-2)),2),ROUND((OFFSET('climo data'!A33,0,(InputControl!$B$17*4)-4)*OFFSET('climo data'!$A$36,0,(InputControl!$B$17*4)-2)),2))","v":1.57},{"$f":"IF(InputControl!$B$12=2,OFFSET('climo data'!A14,0,(InputControl!$B$17*4)-2),OFFSET('climo data'!A33,0,(InputControl!$B$17*4)-2))","v":69.13},{"$f":"IF(InputControl!$B$12=2,OFFSET('climo data'!A14,0,(InputControl!$B$17*4)-1),OFFSET('climo data'!A33,0,(InputControl!$B$17*4)-1))","v":7.31},null,{"$f":"IF(InputControl!$B$57<50,VLOOKUP(\"k\",'crop k''s'!$A$4:$Q$15,'crop k''s'!$D$104,FALSE),'crop k''s'!P79)","v":0.67},5.0534030000000003,0.88194899999999998,4.4568440000000002,2.9860850000000001,1.0932740000000001,1.181524,0.73289199999999999,0.94669800000000004,{"$f":"IF(InputControl!$B$12=2,(0.70917*(A14^0.82416)-0.11556),(0.70917*(A14^0.82416)-0.11556))","v":1.0932740000000001},{"$f":"IF(InputControl!$B$12=2,(O14*L14*M14)*OFFSET('climo data'!$C$17,0,(InputControl!$B$17*4)-4),(O14*L14*M14)*OFFSET('climo data'!$C$36,0,(InputControl!$B$17*4)-4))","v":0.77629300000000001}]
[{"$f":"IF(InputControl!$B$12=2,OFFSET('climo data'!A15,0,(InputControl!$B$17*4)-4),OFFSET('climo data'!A34,0,(InputControl!$B$17*4)-4))","v":1.58},{"$f":"IF(InputControl!$B$12=2,ROUND((OFFSET('climo data'!A15,0,(InputControl!$B$17*4)-4)*OFFSET('climo data'!$A$17,0,(InputControl!$B$17*4)-2)),2),ROUND((OFFSET('climo data'!A34,0,(InputControl!$B$17*4)-4)*OFFSET('climo data'!$A$36,0,(InputControl!$B$17*4)-2)),2))","v":1.3},{"$f":"IF(InputControl!$B$12=2,OFFSET('climo data'!A15,0,(InputControl!$B$17*4)-2),OFFSET('climo data'!A34,0,(InputControl!$B$17*4)-2))","v":63.65},{"$f":"IF(InputControl!$B$12=2,OFFSET('climo data'!A15,0,(InputControl!$B$17*4)-1),OFFSET('climo data'!A34,0,(InputControl!$B$17*4)-1))","v":7.31},null,{"$f":"IF(InputControl!$B$57<50,VLOOKUP(\"l\",'crop k''s'!$A$4:$Q$15,'crop k''s'!$D$104,FALSE),'crop k''s'!P80)","v":0.55000000000000004},4.6528150000000004,0.78714499999999998,3.6624400000000001,2.0143420000000001,0.91833299999999995,1.1190979999999999,0.73289199999999999,0.75319599999999998,{"$f":"IF(InputControl!$B$12=2,(0.70917*(A15^0.82416)-0.11556),(0.70917*(A15^0.82416)-0.11556))","v":0.91833299999999995},{"$f":"IF(InputControl!$B$12=2,(O15*L15*M15)*OFFSET('climo data'!$C$17,0,(InputControl!$B$17*4)-4),(O15*L15*M15)*OFFSET('climo data'!$C$36,0,(InputControl!$B$17*4)-4))","v":0.61762099999999998}]
[]
[]
[]
[null,null,null,null,null,null,{"$f":"(Exhibit!O25*Input2!$C$13*Exhibit!C11*0.02715)","v":1.180563},"Average Annual",null,null,{"$f":"SUM(G19)*1000000/365","v":3234.42},"GPD","Max Day (Gallons)"]
[null,"Salt Flush",null,{"$f":"IF((InputControl!$B$57=13)*AND(InputControl!$A$160<>0)*AND(Input2!C14=\"YES\"), Input2!$C$13*Input2!G14*0.02715,0)","v":0},null,null,null,null,null,null,{"$f":"SUM(G19)/365","v":0},"MGD","Max Day (MG)"]
[null,null,null,null,null,null,"With Salt"]
[null,null,null,"Maximum Month Inches",{"$f":"IF((InputControl!$B$57=13)*AND(InputControl!$A$160<>0),InputControl!A160,MAX(,Exhibit!C25:N25))","v":4.8600000000000003},{"$f":"(E22*Input2!$C$13*Exhibit!C11*0.02715)","v":0.15570000000000001},{"$f":"(F22+D20)","v":0.15570000000000001},"Maximum Monthly"]
[]
[null,null,null,null,"Round Salt Flush","Round Max Month","With Salt",null,null,"Round Annual "]
[null,null,null,">1",{"$f":"IF(D20>=1,TEXT(ROUND(D20,2),\"#,###.##\"),\"\")","v":""},{"$f":"IF(F22>=1,TEXT(ROUND(F22,2),\"#,###.##\"),\"\")","v":""},{"$f":"IF(G22>=1,TEXT(ROUND(G22,2),\"#,###.##\"),\"\")","v":""},"MG",">1",{"$f":"IF(G19>=1,TEXT(ROUND(G19,2),\"#,###.##\"),\"\")","v":"1.18"},"MG"]
[null,null,null,">.1<1",{"$f":"IF(AND(D20<1,D20>=0.1),TEXT(ROUND(D20*1000000,-3),\"#,###\"),\"\")","v":""},{"$f":"IF(AND(F22<1,F22>=0.1),TEXT(ROUND(F22*1000000,-3),\"#,###\"),\"\")","v":"156,000"},{"$f":"IF(AND(G22<1,G22>=0.1),TEXT(ROUND(G22*1000000,-3),\"#,###\"),\"\")","v":"156,000"},"gallons",">.1<1",{"$f":"IF(AND(G19<1,G19>=0.1),TEXT(ROUND(G19*1000000,-3),\"#,###\"),\"\")","v":""},"gallons"]
[null,null,null,".1<",{"$f":"IF(AND(D20<0.1,D20>=0.01),TEXT(ROUND(D20*1000000,-2),\"#,###\"),\"\")","v":""},{"$f":"IF(AND(F22<0.1,F22>=0.01),TEXT(ROUND(F22*1000000,-2),\"#,###\"),\"\")","v":""},{"$f":"IF(AND(G22<0.1,G22>=0.01),TEXT(ROUND(G22*1000000,-2),\"#,###\"),\"\")","v":""},"gallons",".1<",{"$f":"IF(AND(G19<0.1,G19>=0.01),TEXT(ROUND(G19*1000000,-2),\"#,###\"),\"\")","v":""},"gallons"]
[null,null,null,".01<",{"$f":"IF(D20<0.01,TEXT(ROUND(D20*1000000,-1),\"#,###\"),\"\")","v":""},{"$f":"IF(F22<0.01,TEXT(ROUND(F22*1000000,-1),\"#,###\"),\"\")","v":""},{"$f":"IF(G22<0.01,TEXT(ROUND(G22*1000000,-1),\"#,###\"),\"\")","v":""},"gallons",".01<",{"$f":"IF(G19<0.01,TEXT(ROUND(G19*1000000,-1),\"#,###\"),\"\")","v":""},"gallons"]
[]
[null,null,null,null," ",null,null,"With Salt"]
[null,null,null,null," ","Annual",{"$f":"IF(G19>=1,J25,IF(AND(G19<1,G19>=0.1),J26,IF(AND(G19<0.1,G19>=0.01),J27,IF(G19<0.01,J28,\"\"))))","v":"1.18"},{"$f":"IF(G19>=1,J25,IF(AND(G19<1,G19>=0.1),J26,IF(AND(G19<0.1,G19>=0.01),J27,IF(G19<0.01,J28,\"\"))))","v":"1.18"}]
[null,null,null,null,"Salt Flush","Annual",{"$f":"IF(G19>1,\" MG\", \" gallons\")","v":" MG"},{"$f":"IF(G19>1,\" MG\", \" gallons\")","v":" MG"}]
[null,null,null,null,{"$f":"IF(D20>=1,E25,IF(AND(D20<1,D20>=0.1),E26,IF(AND(D20<0.1,D20>=0.01),E27,IF(D20<0.01,E28,\"\"))))","v":""},"Month",{"$f":"IF(F22>=1,F25,IF(AND(F22<1,F22>=0.1),F26,IF(AND(F22<0.1,F22>=0.01),F27,IF(F22<0.01,F28,\"\"))))","v":"156,000"},{"$f":"IF(G22>=1,G25,IF(AND(G22<1,G22>=0.1),G26,IF(AND(G22<0.1,G22>=0.01),G27,IF(G22<0.01,G28,\"\"))))","v":"156,000"}]
[null,null,null,null,{"$f":"IF(D20>1,\" MG\",IF(D20=0,\"\",\" gallons\"))","v":""},"Month",{"$f":"IF(F22>1,\" MG\", \" gallons\")","v":" gallons"},{"$f":"IF(G22>1,\" MG\", \" gallons\")","v":" gallons"}]

{"sheet":"Crop Count","index":7,"n_rows":57,"n_cols":42,"rows_kept":57,"cut":false,"hidden":false,"merged":[[1,1,1,2]]}
[null,"Total Count of Crops"]
[" ",0]
[]
[null,null,null,null,"SINGLE REVIEW INPUT",null,null,null,null,null,null,null,null,null,null,"CITRUS                       SALT FLUSH","CITRUS                       SALT FLUSH","CITRUS                       SALT FLUSH"]
["Crop No.","Plant No. in Parcel","Multiple Plantings in Parcel","Salt Flush","Parcel Name","Crop No.","Crop","Acreage","Rainfall Station","Irrigation System","Irrigation System Multiplier","Soil","Calculations",{"$f":"Exhibit!$C$19","v":"Jan"},{"$f":"Exhibit!$D$19","v":"Feb"},{"$f":"Exhibit!$E$19","v":"Mar"},{"$f":"Exhibit!$F$19","v":"Apr"},{"$f":"Exhibit!$G$19","v":"May"},{"$f":"Exhibit!$H$19","v":"Jun"},{"$f":"Exhibit!$I$19","v":"Jul"},{"$f":"Exhibit!$J$19","v":"Aug"},{"$f":"Exhibit!$K$19","v":"Sep"},{"$f":"Exhibit!$L$19","v":"Oct"},{"$f":"Exhibit!$M$19","v":"Nov"},{"$f":"Exhibit!$N$19","v":"Dec"},{"$f":"Exhibit!$O$19","v":"Total"},"Max Month (Value)","Max Month (Month)","Max Month (Citrus Value)","Max Month (Citrus Month)","Multiple Plantings in Parcel (Max Month)","Annual","Max Month (MG)","ANNUAL (MG)","SALT FLUSH (MG)"]
[null,null,null,{"$f":"IF((InputControl!$B$57=13)*AND(InputControl!$A$160<>0)*AND(Input2!$C$14=\"YES\"),\"YES\",\"NO\")","v":"NO"},{"$f":"IF(Input2!N8<>\"\",Input2!N8,\" \")","v":" "},{"$f":"InputControl!B57","v":5},{"$f":"Exhibit!C9","v":"Nursery"},{"$f":"Exhibit!C8","v":1},{"$f":"Exhibit!C6","v":"Okeechobee     1-in-10"},{"$f":"Exhibit!C7","v":"Drip"},{"$f":"Exhibit!C11","v":1.18},{"$f":"Exhibit!C10","v":0.8},{"$f":"Exhibit!B25","v":"1-in-10 Irrigation (inches)"},{"$f":"Exhibit!C25","v":1.04},{"$f":"Exhibit!D25","v":1.22},{"$f":"IF((InputControl!$B$57=13)*AND(InputControl!$A$160<>0)*AND(InputControl!$B$156=1),InputControl!A160,Exhibit!E25)","v":2.41},{"$f":"IF((InputControl!$B$57=13)*AND(InputControl!$A$160<>0)*AND(InputControl!$B$156=2),InputControl!A160,Exhibit!F25)","v":3.75},{"$f":"IF((InputControl!$B$57=13)*AND(InputControl!$A$160<>0)*AND(InputControl!$B$156=3),InputControl!A160,Exhibit!G25)","v":4.66},{"$f":"Exhibit!H25","v":4.17},{"$f":"Exhibit!I25","v":4.8600000000000003},{"$f":"Exhibit!J25","v":4.5},{"$f":"Exhibit!K25","v":3.59},{"$f":"Exhibit!L25","v":3.05},{"$f":"Exhibit!M25","v":2.21},{"$f":"Exhibit!N25","v":1.39},{"$f":"SUM(N6:Y6)","v":36.85},{"$f":"MAX(N6:Y6)","v":4.8600000000000003},"MAY",{"$f":"IF((InputControl!$B$57=13)*AND(InputControl!$A$160<>0),InputControl!A160,\"\")","v":""},{"$f":"IF((InputControl!$B$57=13)*AND(InputControl!$A$160<>0),InputControl!C156,\"\")","v":""},null,{"$f":"Exhibit!O25","v":36.85},{"$f":"IF((InputControl!$B$57=13)*AND(InputControl!$A$160<>0),AC6*H6*K6*0.02715,AA6*H6*K6*0.02715)","v":0.15570000000000001},{"$f":"AF6*H6*K6*0.02715","v":1.180563},"WITHOUT SALT FLUSH"]
[null,null,null,null,null,null,null,null,null,null,null,null,null,{"$f":"N$6*$H$6*$K$6*0.02715","v":3.3318E-2},{"$f":"O$6*$H$6*$K$6*0.02715","v":3.9085000000000002E-2},{"$f":"IF((InputControl!$B$57=13)*AND(InputControl!$A$160<>0)*AND(InputControl!$B$156=1),P$6*$H$6*$K$6*0.02715+'Blaney Calc'!D20,P$6*$H$6*$K$6*0.02715)","v":7.7209E-2},{"$f":"IF((InputControl!$B$57=13)*AND(InputControl!$A$160<>0)*AND(InputControl!$B$156=2),Q$6*$H$6*$K$6*0.02715+'Blaney Calc'!D20,Q$6*$H$6*$K$6*0.02715)","v":0.120139},{"$f":"IF((InputControl!$B$57=13)*AND(InputControl!$A$160<>0)*AND(InputControl!$B$156=3),R$6*$H$6*$K$6*0.02715+'Blaney Calc'!D20,R$6*$H$6*$K$6*0.02715)","v":0.14929200000000001},0.13359399999999999,0.15570000000000001,0.14416699999999999,0.115013,9.7712999999999994E-2,7.0802000000000004E-2,4.4531000000000001E-2,1.180563,{"$f":"MAX(N6:Y6)*$H$6*$K$6*0.02715","v":0.15570000000000001},null,{"$f":"IF((InputControl!$B$57=13)*AND(InputControl!$A$160<>0),InputControl!A160*$H$6*$K$6*0.02715,\"\")","v":""},null,null,{"$f":"Exhibit!O25*$H$6*$K$6*0.02715","v":1.180563},{"$f":"IF((InputControl!$B$57=13)*AND(InputControl!$A$160<>0),AC6*H6*K6*0.02715+AI7,AA6*H6*K6*0.02715)","v":0.15570000000000001},{"$f":"SUM(N7:Y7)","v":1.180563},{"$f":"'Blaney Calc'!D20","v":0}]
["ROW",12,null,null,"ALL CROP PLANTINGS IN MG",null,null,null,null,null,null,null,null,null,"WITHOUT SALT FLUSH",{"$f":"IF((InputControl!$B$57=13)*AND(InputControl!$A$160<>0)*AND(InputControl!$B$156=1),P$6*$H$6*$K$6,P$6*$H$6*$K$6*0.02715)","v":7.7209E-2},{"$f":"IF((InputControl!$B$57=13)*AND(InputControl!$A$160<>0)*AND(InputControl!$B$156=3),Q$6*$H$6*$K$6*0.02715,Q$6*$H$6*$K$6*0.02715)","v":0.120139},{"$f":"IF((InputControl!$B$57=13)*AND(InputControl!$A$160<>0)*AND(InputControl!$B$156=3),R$6*$H$6*$K$6*0.02715,R$6*$H$6*$K$6*0.02715)","v":0.14929200000000001},null,null,null,null,null,null,null,null,null,{"$f":"MATCH(MAX(N6:Y6),N6:Y6,0)","v":7}]
["Crop No.","Plant No. in Parcel","Multiple Plantings in Parcel","Salt Flush","Parcel Name","Crop No.","Crop","Acreage","Rainfall Station","Irrigation System","Irrigation System Multiplier","Soil","Calculations",{"$f":"Exhibit!$C$19","v":"Jan"},{"$f":"Exhibit!$D$19","v":"Feb"},{"$f":"Exhibit!$E$19","v":"Mar"},{"$f":"Exhibit!$F$19","v":"Apr"},{"$f":"Exhibit!$G$19","v":"May"},{"$f":"Exhibit!$H$19","v":"Jun"},{"$f":"Exhibit!$I$19","v":"Jul"},{"$f":"Exhibit!$J$19","v":"Aug"},{"$f":"Exhibit!$K$19","v":"Sep"},{"$f":"Exhibit!$L$19","v":"Oct"},{"$f":"Exhibit!$M$19","v":"Nov"},{"$f":"Exhibit!$N$19","v":"Dec"},{"$f":"Exhibit!$O$19","v":"Total"},"Max Month","Max Month (Month)","Max Month (Citrus)","Max Month (Citrus Month)","Multiple Plantings in Parcel (Max Month)","Annual","Max Month (MG)","ANNUAL (MG)"]
[1,1,"NO","NO"," ",20,"Pasture",217,"Moore Haven     1-in-10","Flood/Seepage",2,0.8,"1-in-10 Irrigation (inches)",11.193944999999999,15.907185,26.983298999999999,34.406652000000001,38.412906,16.849833,23.801862,25.215834000000001,14.257550999999999,21.798735000000001,17.556819000000001,12.018762000000001,258.40338300000002,38.412906,null,"",null,null,258.40338300000002,38.412906,258.40338300000002]
[2,1,"NO","NO"," ",10,"Sugarcane",156,"Moore Haven     1-in-10","Flood/Seepage",2,0.8,"1-in-10 Irrigation (inches)",6.0142680000000004,2.7953640000000002,15.501564,21.515832,27.614808,26.767728000000002,31.003128,33.45966,21.177,32.189039999999999,20.922875999999999,16.348644,255.309912,33.45966,null,"",null,null,255.309912,33.45966,255.309912]
[3,1,"NO","NO"," ",13,"Citrus",1810,"Moore Haven     1-in-10","Micro-sprinkler",1.18,0.8,"1-in-10 Irrigation (inches)",89.879803999999993,90.459672999999995,146.12716399999999,175.70051900000001,299.21276499999999,153.085601,179.17973699999999,176.86025900000001,134.52977000000001,155.984949,131.05055200000001,101.477198,1833.5479909999999,299.21276499999999,null,299.21276499999999,null,null,1727.431836,299.21276499999999,1833.5479909999999]
[]
[]
[]
[]
[]
[]
[]
[]
[null,null,null,null,null,null,null,null,null,null,null,null,null,null,null,null,null,null,null,null,null,null,null,null,null,null,null,null,null,null,null,null,null,null,null,null,"Round Max Month",null,null,null,"Round Annual "]
[null,null,null,null,null,null,null,null,null,null,null,null,null,null,null,null,null,null,null,null,null,null,null,null,null,null,null,null,null,null,null,null,null,null,null,null,">1",{"$f":"IF(AE30>=1,TEXT(ROUND(AE30,2),\"#,###.##\"),\"\")","v":"365.24"},"MG",">1",{"$f":"IF(AF30>=1,TEXT(ROUND(AF30,2),\"#,###.##\"),\"\")","v":"2,241.15"},"MG"]
[null,null,null,null,null,null,null,null,null,null,null,null,null,null,null,null,null,null,null,null,null,null,null,null,null,null,null,null,null,null,null,null,null,null,null,null,">.1<1",{"$f":"IF(AND(AE30<1,AE30>=0.1),TEXT(ROUND(AE30*1000000,-3),\"#,###\"),\"\")","v":""},"gallons",">.1<1",{"$f":"IF(AND(AF30<1,AF30>=0.1),TEXT(ROUND(AF30*1000000,-3),\"#,###\"),\"\")","v":""},"gallons"]
[null,null,null,null,null,null,null,null,null,null,null,null,null,null,null,null,null,null,null,null,null,null,null,null,null,null,null,null,null,null,null,null,null,null,null,null,".1<",{"$f":"IF(AND(AE30<0.1,AE30>=0.01),TEXT(ROUND(AE30*1000000,-2),\"#,###\"),\"\")","v":""},"gallons",".1<",{"$f":"IF(AND(AF30<0.1,AF30>=0.01),TEXT(ROUND(AF30*1000000,-2),\"#,###\"),\"\")","v":""},"gallons"]
[null,null,null,null,null,null,null,null,null,null,null,null,null,null,null,null,null,null,null,null,null,null,null,null,null,null,null,null,null,null,null,null,null,null,null,null,".01<",{"$f":"IF(AE30<0.01,TEXT(ROUND(AE30*1000000,-1),\"#,###\"),\"\")","v":""},"gallons",".01<",{"$f":"IF(AF30<0.01,TEXT(ROUND(AF30*1000000,-1),\"#,###\"),\"\")","v":""},"gallons"]
[]
[]
[]
[null,null,null,null,null,null,null,null,null,null,null,null,null,null,null,null,null,null,null,null,null,null,null,null,null,null,null,null,null,null,null,null,null,null,"Formatted","Formatted"]
["ROW",0,null,null,"CALCULATIONS FOR MULTIPLE ANNUAL PLANTINGS IN PARCEL IN MG",null,null,null,null,null,null,null,null,{"$f":"SUM(N10:N29)","v":107.08801699999999},{"$f":"SUM(O10:O29)","v":109.162222},188.61202700000001,231.62300300000001,365.24047899999999,196.70316199999999,233.98472699999999,235.535753,169.96432100000001,209.972724,169.530247,129.844604,null,null,null,"","",{"$f":"MAX(N30:Y30)","v":365.24047899999999},{"$f":"SUM(AF10:AF29)","v":2241.1451310000002},{"$f":"SUM(AG10:AG29)","v":371.085331},{"$f":"SUM(AH10:AH29)","v":2347.2612859999999},{"$f":"IF(AE30>=1,AL22,IF(AND(AE30<1,AE30>=0.1),AL23,IF(AND(AE30<0.1,AE30>=0.01),AL24,IF(AE30<0.01,AL25,\"\"))))","v":"365.24"},{"$f":"IF(AF30>=1,AO22,IF(AND(AF30<1,AF30>=0.1),AO23,IF(AND(AF30<0.1,AF30>=0.01),AO24,IF(AF30<0.01,AO25,\"\"))))","v":"2,241.15"}]
["Crop No.","Plant No. in Parcel","Multiple Plantings in Parcel","Salt Flush","Parcel Name","Crop No.","Crop","Acreage","Rainfall Station","Irrigation System","Irrigation System Multiplier","Soil","Calculations",{"$f":"Exhibit!$C$19","v":"Jan"},{"$f":"Exhibit!$D$19","v":"Feb"},{"$f":"Exhibit!$E$19","v":"Mar"},{"$f":"Exhibit!$F$19","v":"Apr"},{"$f":"Exhibit!$G$19","v":"May"},{"$f":"Exhibit!$H$19","v":"Jun"},{"$f":"Exhibit!$I$19","v":"Jul"},{"$f":"Exhibit!$J$19","v":"Aug"},{"$f":"Exhibit!$K$19","v":"Sep"},{"$f":"Exhibit!$L$19","v":"Oct"},{"$f":"Exhibit!$M$19","v":"Nov"},{"$f":"Exhibit!$N$19","v":"Dec"},{"$f":"Exhibit!$O$19","v":"Total"},"Max Month","Max Month (month)","Max Month (Citrus)","Max Month (Citrus Month)","Multiple Plantings in Parcel (Max Month)","Annual","Max Month (MG)","ANNUAL (MG)",{"$f":"IF(AE30>1,\" MG\", \" gallons\")","v":" MG"},{"$f":"IF(AF30>1,\" MG\", \" gallons\")","v":" MG"}]
[]
[]
[]
[]
[]
[]
[]
[]
[]
[]
[]
[null,null,null,null,null,null,null,null,null,null,null,null,null,{"$f":"SUM(N32:N41)","v":0},0,0,0,0,0,0,0,0,0,0,0,null,null,null,null,null,null,{"$f":"SUM(AF32:AF41)","v":0},{"$f":"MAX(N43:Y43)","v":0},{"$f":"SUM(AH32:AH41)","v":0}]
[{"$f":"COLUMN(A43)","v":1},2,3,null,5,6,7,8,9,10,11,12,13,{"$f":"COLUMN(N43)","v":14},{"$f":"COLUMN(O43)","v":15},16,17,18,19,20,21,22,23,24,25,{"$f":"COLUMN(Z43)","v":26},27,28,29,30,31,32,{"$f":"MATCH(MAX(N43:Y43),N43:Y43,0)","v":1},{"$f":"COLUMN(AH43)","v":34}]
[]
["ROW",3,null,null,"CITRUS REVIEW INPUT WITHOUT FULL ET"]
["Crop No.","Plant No. in Parcel","Multiple Plantings in Parcel","Salt Flush","Parcel Name","Crop No.","Crop","Acreage","Rainfall Station","Irrigation System","Irrigation System Multiplier","Soil","Calculations",{"$f":"Exhibit!$C$19","v":"Jan"},{"$f":"Exhibit!$D$19","v":"Feb"},{"$f":"Exhibit!$E$19","v":"Mar"},{"$f":"Exhibit!$F$19","v":"Apr"},{"$f":"Exhibit!$G$19","v":"May"},{"$f":"Exhibit!$H$19","v":"Jun"},{"$f":"Exhibit!$I$19","v":"Jul"},{"$f":"Exhibit!$J$19","v":"Aug"},{"$f":"Exhibit!$K$19","v":"Sep"},{"$f":"Exhibit!$L$19","v":"Oct"},{"$f":"Exhibit!$M$19","v":"Nov"},{"$f":"Exhibit!$N$19","v":"Dec"},{"$f":"Exhibit!$O$19","v":"Total"},"Max Month (Value)","Max Month (Month)","Max Month (Citrus Value)","Max Month (Citrus Month)","Multiple Plantings in Parcel (Max Month)","Annual","Max Month (MG)","ANNUAL (MG)"]
[null,null,null,null,{"$f":"IF(Input2!N8<>\"\",Input2!N8,\" \")","v":" "},{"$f":"InputControl!B57","v":5},{"$f":"Exhibit!C9","v":"Nursery"},{"$f":"Exhibit!C8","v":1},{"$f":"Exhibit!C6","v":"Okeechobee     1-in-10"},{"$f":"Exhibit!C7","v":"Drip"},{"$f":"Exhibit!C11","v":1.18},{"$f":"Exhibit!C10","v":0.8},{"$f":"Exhibit!B25","v":"1-in-10 Irrigation (inches)"},{"$f":"Exhibit!C25","v":1.04},{"$f":"Exhibit!D25","v":1.22},{"$f":"Exhibit!E25","v":2.41},{"$f":"Exhibit!F25","v":3.75},{"$f":"Exhibit!G25","v":4.66},{"$f":"Exhibit!H25","v":4.17},{"$f":"Exhibit!I25","v":4.8600000000000003},{"$f":"Exhibit!J25","v":4.5},{"$f":"Exhibit!K25","v":3.59},{"$f":"Exhibit!L25","v":3.05},{"$f":"Exhibit!M25","v":2.21},{"$f":"Exhibit!N25","v":1.39},{"$f":"SUM(N48:Y48)","v":36.85},{"$f":"MAX(N48:Y48)","v":4.8600000000000003},"MAY",{"$f":"IF((InputControl!$B$57=13)*AND(InputControl!$A$160<>0),InputControl!A160,\"\")","v":""},{"$f":"IF((InputControl!$B$57=13)*AND(InputControl!$A$160<>0),InputControl!C156,\"\")","v":""},null,{"$f":"Exhibit!O25","v":36.85},{"$f":"IF((InputControl!$B$57=13)*AND(InputControl!$A$160<>0),AC48*H48*K48*0.02715,AA48*H48*K48*0.02715)","v":0.15570000000000001},{"$f":"AF48*H48*K48*0.02715","v":1.180563}]
[null,null,null,null,null,null,null,null,null,null,null,null,null,{"$f":"N$48*$H$6*$K$6*0.02715","v":3.3318E-2},{"$f":"O$48*$H$6*$K$6*0.02715","v":3.9085000000000002E-2},7.7209E-2,0.120139,0.14929200000000001,0.13359399999999999,0.15570000000000001,0.14416699999999999,0.115013,9.7712999999999994E-2,7.0802000000000004E-2,4.4531000000000001E-2,{"$f":"Z$48*$H$6*$K$6*0.02715","v":1.180563},{"$f":"MAX(N48:Y48)*$H$6*$K$6*0.02715","v":0.15570000000000001},null,{"$f":"IF((InputControl!$B$57=13)*AND(InputControl!$A$160<>0),InputControl!A160*$H$6*$K$6*0.02715,\"\")","v":""},null,null,{"$f":"Exhibit!O25*$H$6*$K$6*0.02715","v":1.18056345},{"$f":"IF((InputControl!$B$57=13)*AND(InputControl!$A$160<>0),AC48*H48*K48*0.02715,AA48*H48*K48*0.02715)","v":0.15570000000000001},{"$f":"SUM(N49:Y49)","v":1.180563}]
[null,null,null,null,null,null,null,null,null,null,null,null,null,null,null,null,null,null,null,null,null,null,null,null,null,null,null,{"$f":"MATCH(MAX(N48:Y48),N48:Y48,0)","v":7}]
[]
[]
["ROW",57,null,null,"ALL CROP PLANTINGS IN INCHES"]
["Crop No.","Plant No. in Parcel","Multiple Plantings in Parcel","Salt Flush","Parcel Name","Crop No.","Crop","Acreage","Rainfall Station","Irrigation System","Irrigation System Multiplier","Soil","Calculations",{"$f":"Exhibit!$C$19","v":"Jan"},{"$f":"Exhibit!$D$19","v":"Feb"},{"$f":"Exhibit!$E$19","v":"Mar"},{"$f":"Exhibit!$F$19","v":"Apr"},{"$f":"Exhibit!$G$19","v":"May"},{"$f":"Exhibit!$H$19","v":"Jun"},{"$f":"Exhibit!$I$19","v":"Jul"},{"$f":"Exhibit!$J$19","v":"Aug"},{"$f":"Exhibit!$K$19","v":"Sep"},{"$f":"Exhibit!$L$19","v":"Oct"},{"$f":"Exhibit!$M$19","v":"Nov"},{"$f":"Exhibit!$N$19","v":"Dec"},{"$f":"Exhibit!$O$19","v":"Total"},"Max Month (Value)","Max Month (Month)","Max Month (Citrus Value)","Max Month (Citrus Month)","Multiple Plantings in Parcel (Max Month)","Annual","Max Month (MG)","ANNUAL (MG)"]
[1,1,"NO","NO"," ",20,"Pasture",217,"Moore Haven     1-in-10","Flood/Seepage",2,0.8,"1-in-10 Irrigation (inches)",0.95,1.35,2.29,2.92,3.26,1.43,2.02,2.14,1.21,1.85,1.49,1.02,21.93,3.26,"MAY"]
[2,1,"NO","NO"," ",10,"Sugarcane",156,"Moore Haven     1-in-10","Flood/Seepage",2,0.8,"1-in-10 Irrigation (inches)",0.71,0.33,1.83,2.54,3.26,3.16,3.66,3.95,2.5,3.8,2.4700000000000002,1.93,30.14,3.95,"AUG"]
[3,null,null,null," ",13,"Citrus",1810,"Moore Haven     1-in-10","Micro-sprinkler",1.18,0.8,"1-in-10 Irrigation (inches)",1.55,1.56,2.52,3.03,3.33,2.64,3.09,3.05,2.3199999999999998,2.69,2.2599999999999998,1.75,29.79,3.33,"MAY",5.16,"MAY"]

{"sheet":"climo data","index":8,"n_rows":44,"n_cols":148,"rows_kept":44,"cut":false,"hidden":true,"merged":[]}
["2-in-10"]
["Archbold (No Data)",null,null,null,"Avon Park",null,null,null,"Belle Glade",null,null,null,"Big Cypress",null,null,null,"Clewiston",null,null,null,"Everglades",null,null,null,"Fellsmere",null,null,null,"Fort Drum (No Data)",null,null,null,"Ft. Lauderdale",null,null,null,"Ft. Myers",null,null,null,"Ft. Pierce",null,null,null,"Hialeah",null,null,null,"Homestead",null,null,null,"Hypoluxo",null,null,null,"Immokalee (No Data)",null,null,null,"Indiantown",null,null,null,"Jupiter",null,null,null,"Kissimmee",null,null,null,"La Belle",null,null,null,"Lake Placid",null,null,null,"Loxahatchee",null,null,null,"Melbourne",null,null,null,"Merritt Island",null,null,null,"Miami",null,null,null,"Moore Haven",null,null,null,"Naples",null,null,null,"Okeechobee",null,null,null,"Orlando",null,null,null,"Pompano Beach",null,null,null,"Punta Gorda (No Data)",null,null,null,"Stuart",null,null,null,"S-65 (No Data)",null,null,null,"S 140 W (No Data)",null,null,null,"Tamiami 4",null,null,null,"Titusville",null,null,null,"Vero Beach",null,null,null,"West Palm Beach"]
[null,null,null,null,"Rain",null,"Temp","Sun","Rain",null,"Temp","Sun","Rain",null,"Temp","Sun","Rain",null,"Temp","Sun","Rain",null,"Temp","Sun","Rain",null,"Temp","Sun",null,null,null,null,"Rain",null,"Temp","Sun","Rain",null,"Temp","Sun","Rain",null,"Temp","Sun","Rain",null,"Temp","Sun","Rain",null,"Temp","Sun","Rain",null,"Temp","Sun",null,null,null,null,"Rain",null,"Temp","Sun","Rain",null,"Temp","Sun","Rain",null,"Temp","Sun","Rain",null,"Temp","Sun","Rain",null,"Temp","Sun","Rain",null,"Temp","Sun","Rain",null,"Temp","Sun","Rain",null,"Temp","Sun","Rain",null,"Temp","Sun","Rain",null,"Temp","Sun","Rain",null,"Temp","Sun","Rain",null,"Temp","Sun","Rain",null,"Temp","Sun","Rain",null,"Temp","Sun",null,null,null,null,"Rain",null,"Temp","Sun",null,null,null,null,null,null,null,null,"Rain",null,"Temp","Sun","Rain",null,"Temp","Sun","Rain",null,"Temp","Sun","Rain",null,"Temp","Sun"]
[null,null,null,null,2.17,null,63.46,7.42,1.88,null,63.17,7.46,1.69,null,62.74,7.48,1.31,null,63.45,7.45,1.63,null,66.3,7.49,2.2000000000000002,null,62.96,7.41,null,null,null,null,2.54,null,67.739999999999995,7.49,1.9,null,64.319999999999993,7.46,2.44,null,64.7,7.42,2.1,null,65.91,7.49,1.67,null,65.8,7.52,2.89,null,67.72,7.46,null,null,null,null,2.23,null,63.97,7.44,3.66,null,67.989999999999995,7.44,2.35,null,61.07,7.39,1.62,null,63.79,7.45,1.83,null,62.83,7.43,2.44,null,64.150000000000006,7.46,2.04,null,61.55,7.4,2.65,null,62.49,7.38,2.58,null,67.510000000000005,7.5,1.54,null,63.43,7.44,1.81,null,65.56,7.49,1.75,null,62.69,7.43,2.2999999999999998,null,61.27,7.38,2.41,null,67.099999999999994,7.48,null,null,null,null,2.34,null,65.489999999999995,7.44,null,null,null,null,null,null,null,null,1.44,null,67.12,7.5,2.14,null,61.26,7.37,2.0499999999999998,null,63.05,7.41,2.42,null,66.33,7.47]
[null,null,null,null,2.71,null,64.709999999999994,7.08,1.87,null,64.150000000000006,7.11,2.59,null,63.2,7.12,1.89,null,65.569999999999993,7.1,1.68,null,67.41,7.12,2.2999999999999998,null,64.28,7.08,null,null,null,null,2.2599999999999998,null,68.11,7.12,2.16,null,65.36,7.11,2.66,null,65.569999999999993,7.09,1.9,null,66.53,7.12,1.73,null,66.599999999999994,7.13,2.72,null,68.09,7.11,null,null,null,null,3.08,null,65.41,7.1,2.4900000000000002,null,67.77,7.1,2.84,null,62.42,7.06,2.2599999999999998,null,65.08,7.1,2.4500000000000002,null,64.95,7.09,2.56,null,64.75,7.11,2.72,null,63.2,7.07,2.54,null,63.68,7.06,2.14,null,67.94,7.13,1.9,null,64.59,7.1,2.02,null,66.58,7.12,2,null,64.180000000000007,7.09,2.4300000000000002,null,63.12,7.06,2.34,null,67.459999999999994,7.12,null,null,null,null,2.46,null,66.349999999999994,7.1,null,null,null,null,null,null,null,null,1.46,null,68.75,7.12,2.39,null,62.9,7.06,2.4500000000000002,null,64.63,7.08,2.54,null,66.88,7.11]
[null,null,null,null,2.6,null,68.12,8.3699999999999992,2.89,null,66.92,8.3800000000000008,1.83,null,67.069999999999993,8.3800000000000008,1.94,null,69.400000000000006,8.3800000000000008,2,null,69.94,8.3800000000000008,3.05,null,67.27,8.3699999999999992,null,null,null,null,2.62,null,70.44,8.3800000000000008,2.21,null,68.62,8.3800000000000008,2.96,null,68.31,8.3800000000000008,2.0499999999999998,null,70.069999999999993,8.3800000000000008,2.36,null,69.36,8.39,3.18,null,69.94,8.3800000000000008,null,null,null,null,3.14,null,68.260000000000005,8.3800000000000008,3.26,null,70.38,8.3800000000000008,3.11,null,66.430000000000007,8.3699999999999992,2.74,null,68.569999999999993,8.3800000000000008,2.65,null,68.67,8.3800000000000008,3.18,null,68.17,8.3800000000000008,3.17,null,66.89,8.3699999999999992,2.93,null,66.8,8.3699999999999992,2.44,null,70.88,8.3800000000000008,2.4,null,67.98,8.3800000000000008,2.11,null,69.81,8.3800000000000008,3.05,null,67.489999999999995,8.3800000000000008,2.81,null,66.8,8.3699999999999992,2.38,null,70.7,8.3800000000000008,null,null,null,null,2.98,null,69.87,8.3800000000000008,null,null,null,null,null,null,null,null,1.89,null,70.819999999999993,8.3800000000000008,3.15,null,65.92,8.3699999999999992,3.58,null,68.06,8.3699999999999992,2.84,null,70.19,8.3800000000000008]
[null,null,null,null,2.89,null,72.819999999999993,8.67,3.08,null,70.73,8.65,2.06,null,70.83,8.64,2.84,null,73.510000000000005,8.66,2.33,null,73.92,8.64,3.14,null,72.02,8.67,null,null,null,null,3.93,null,74.27,8.64,2.37,null,73.069999999999993,8.65,3.27,null,72.62,8.66,3.73,null,73.78,8.64,3.36,null,72.94,8.6300000000000008,3.55,null,73.62,8.65,null,null,null,null,4.1100000000000003,null,72.13,8.66,2.82,null,74.09,8.66,2.7,null,71.47,8.68,2.94,null,72.739999999999995,8.66,3.25,null,72.91,8.66,3.6,null,71.92,8.65,2.35,null,71.41,8.67,2.81,null,71.510000000000005,8.68,3.42,null,73.89,8.6300000000000008,2.87,null,72.17,8.66,2.15,null,73.739999999999995,8.64,3.09,null,71.739999999999995,8.66,2.99,null,71.5,8.68,3.65,null,74.19,8.64,null,null,null,null,3.15,null,73.8,8.66,null,null,null,null,null,null,null,null,2.67,null,73.290000000000006,8.64,2.97,null,71.06,8.68,3.07,null,72.16,8.67,3.64,null,74.22,8.65]
[null,null,null,null,4.43,null,77.45,9.44,4.46,null,74.72,9.4,5.53,null,75.12,9.3800000000000008,4.59,null,77.180000000000007,9.4,4.96,null,77.38,9.3699999999999992,4.3600000000000003,null,75.92,9.44,null,null,null,null,5.78,null,77.400000000000006,9.3699999999999992,3.9,null,77.34,9.4,4.13,null,76.569999999999993,9.43,5.95,null,76.930000000000007,9.3699999999999992,6.48,null,76.2,9.35,4.96,null,76.88,9.4,null,null,null,null,3.94,null,75.989999999999995,9.41,4.8899999999999997,null,76.25,9.41,3.98,null,76.430000000000007,9.4700000000000006,4.1100000000000003,null,76.98,9.4,3.9,null,77.72,9.42,4.59,null,75.94,9.4,3.36,null,75.66,9.4600000000000009,3.71,null,76.48,9.48,6.39,null,77.41,9.36,4.6500000000000004,null,76.28,9.41,3.93,null,77.41,9.3699999999999992,4.1500000000000004,null,75.98,9.42,4.21,null,76.75,9.48,5.08,null,77.02,9.3800000000000008,null,null,null,null,4.4800000000000004,null,77.34,9.42,null,null,null,null,null,null,null,null,6.21,null,76.930000000000007,9.36,4.08,null,76.099999999999994,9.48,3.37,null,76.47,9.44,5.13,null,77.7,9.39]
[null,null,null,null,8.74,null,80.760000000000005,9.3699999999999992,9.48,null,78.41,9.32,8.8000000000000007,null,78.760000000000005,9.3000000000000007,6.73,null,80.23,9.33,9.26,null,80.709999999999994,9.2899999999999991,7.38,null,79.88,9.3699999999999992,null,null,null,null,8.15,null,80.239999999999995,9.2899999999999991,9.09,null,80.599999999999994,9.32,6.4,null,79.959999999999994,9.36,9.24,null,80.03,9.2899999999999991,9.25,null,79.34,9.26,7.61,null,79.959999999999994,9.32,null,null,null,null,9.6999999999999993,null,78.88,9.34,6.37,null,79.86,9.34,7.32,null,80.22,9.4,9.06,null,80.150000000000006,9.33,8.2200000000000006,null,80.69,9.35,9.5,null,79.36,9.32,6.51,null,79.400000000000006,9.39,6.65,null,80.03,9.41,6.85,null,80.28,9.2799999999999994,8.11,null,79.67,9.34,8.5,null,80.819999999999993,9.2899999999999991,7.39,null,79.459999999999994,9.35,6.61,null,80.680000000000007,9.41,7.93,null,79.95,9.3000000000000007,null,null,null,null,7.09,null,80.819999999999993,9.35,null,null,null,null,null,null,null,null,8.9499999999999993,null,80.56,9.2799999999999994,7.38,null,80.06,9.42,4.88,null,79.849999999999994,9.3699999999999992,7.81,null,80.62,9.32]
[null,null,null,null,8.31,null,81.93,9.56,7.86,null,80.099999999999994,9.52,7.63,null,81.63,9.5,6.51,null,81.72,9.52,8.3699999999999992,null,82.18,9.49,7.11,null,81.44,9.56,null,null,null,null,6.11,null,81.760000000000005,9.49,8.4700000000000006,null,81.99,9.52,5.47,null,81.59,9.5500000000000007,7.23,null,81.2,9.49,8.2200000000000006,null,80.45,9.4700000000000006,5.46,null,81.41,9.52,null,null,null,null,6.38,null,80.099999999999994,9.5299999999999994,5.79,null,81.05,9.5299999999999994,7.52,null,81.540000000000006,9.59,8.18,null,81.45,9.52,7.85,null,81.78,9.5399999999999991,8.2200000000000006,null,80.760000000000005,9.52,6.35,null,81.05,9.58,6.07,null,81.38,9.6,5.86,null,81.56,9.48,7.58,null,81.010000000000005,9.5299999999999994,8.35,null,82.34,9.49,6.84,null,80.989999999999995,9.5399999999999991,7.85,null,82.04,9.6,6.74,null,81.430000000000007,9.5,null,null,null,null,6.49,null,82.16,9.5399999999999991,null,null,null,null,null,null,null,null,8.3699999999999992,null,82.41,9.48,8.06,null,81.58,9.6,5.69,null,81.33,9.56,6.67,null,82.47,9.51]
[null,null,null,null,7.54,null,82.37,9.16,8.18,null,80.55,9.1300000000000008,6.87,null,82.11,9.1199999999999992,6.74,null,82.09,9.1300000000000008,7.34,null,82.82,9.11,7.52,null,81.83,9.16,null,null,null,null,6.72,null,82.33,9.11,8,null,82.41,9.1300000000000008,5.68,null,82.01,9.15,7.69,null,81.819999999999993,9.11,7.77,null,80.97,9.09,5.63,null,82,9.1300000000000008,null,null,null,null,7.08,null,81.39,9.14,6.26,null,82.15,9.14,6.88,null,81.87,9.18,7.54,null,81.8,9.1300000000000008,6.88,null,82.3,9.15,8.35,null,81.180000000000007,9.1300000000000008,5.7,null,81.599999999999994,9.17,5.52,null,81.77,9.18,6.27,null,82.16,9.1300000000000008,6.87,null,81.59,9.14,8.25,null,82.91,9.11,6.22,null,81.52,9.15,7.04,null,82.31,9.18,7.07,null,81.819999999999993,9.1199999999999992,null,null,null,null,5.97,null,82.58,9.14,null,null,null,null,null,null,null,null,7.81,null,83.19,9.1300000000000008,7.28,null,81.819999999999993,9.18,6.04,null,81.680000000000007,9.16,6.85,null,82.78,9.1199999999999992]
[null,null,null,null,7.23,null,80.81,8.32,8.76,null,79.55,8.32,7.63,null,80.11,8.32,7.97,null,81.209999999999994,8.32,10.14,null,81.94,8.32,9.1300000000000008,null,80.23,8.32,null,null,null,null,8.56,null,81.34,8.32,8.1300000000000008,null,81.150000000000006,8.32,7.74,null,80.760000000000005,8.32,9.35,null,80.63,8.32,9.98,null,80.150000000000006,8.31,8.39,null,81.22,8.32,null,null,null,null,7.25,null,80.53,8.32,8.6300000000000008,null,81.61,8.32,6.44,null,80.06,8.32,7.69,null,80.67,8.32,7.15,null,80.78,8.32,9.7799999999999994,null,80.3,8.32,7.93,null,79.989999999999995,8.32,7.91,null,80.14,8.32,8.81,null,81,8.32,7.58,null,80.47,8.32,9.51,null,81.97,8.32,7.25,null,80.34,8.32,7.13,null,80.400000000000006,8.32,9.06,null,81,8.32,null,null,null,null,8.65,null,81.349999999999994,8.32,null,null,null,null,null,null,null,null,9.66,null,82.56,8.32,8.56,null,80.150000000000006,8.33,8.9700000000000006,null,80.47,8.32,9.5299999999999994,null,81.72,8.32]
[null,null,null,null,3.88,null,75.64,8.0299999999999994,5.35,null,74.95,8.0500000000000007,5.1100000000000003,null,76.09,8.06,3.72,null,76.31,8.0399999999999991,4.42,null,77.88,8.06,6.76,null,75.38,8.0299999999999994,null,null,null,null,9.5399999999999991,null,77.84,8.06,3.88,null,76.260000000000005,8.0500000000000007,7.21,null,76.48,8.0299999999999994,8.82,null,76.62,8.06,8.58,null,76.56,8.07,8.75,null,77.78,8.0500000000000007,null,null,null,null,5.47,null,75.33,8.0399999999999991,10.37,null,78.14,8.0399999999999991,3.92,null,74.28,8.01,3.86,null,75.56,8.0399999999999991,3.9,null,75.260000000000005,8.0399999999999991,7.89,null,75.709999999999994,8.0500000000000007,5.58,null,74.88,8.02,6.05,null,75.3,8.01,8.86,null,77.540000000000006,8.07,4.24,null,76,8.0399999999999991,4.45,null,77,8.06,4.8099999999999996,null,75.69,8.0399999999999991,4.62,null,74.34,8.01,10.46,null,77.2,8.06,null,null,null,null,8.06,null,77.25,8.0399999999999991,null,null,null,null,null,null,null,null,6.09,null,78.67,8.06,6.41,null,74.81,8.01,6.87,null,75.66,8.0299999999999994,8.6999999999999993,null,77.709999999999994,8.0500000000000007]
[null,null,null,null,1.65,null,68.67,7.3,2.02,null,68.55,7.33,1.69,null,69.5,7.35,1.02,null,69.77,7.33,1.4,null,71.819999999999993,7.36,2.21,null,68.53,7.29,null,null,null,null,3.4,null,72.59,7.36,1.37,null,69.44,7.33,2.69,null,70.14,7.3,2.96,null,71.3,7.36,2.14,null,70.680000000000007,7.38,3.25,null,72.510000000000005,7.33,null,null,null,null,1.96,null,69.36,7.32,3.18,null,71.569999999999993,7.32,1.95,null,66.69,7.27,1.31,null,68.900000000000006,7.33,1.74,null,68.489999999999995,7.31,2.29,null,69.58,7.33,2.57,null,67.91,7.28,2.52,null,68.23,7.26,2.72,null,72.180000000000007,7.37,1.42,null,69.13,7.32,1.36,null,71.260000000000005,7.36,1.46,null,68.819999999999993,7.31,1.72,null,66.650000000000006,7.26,2.75,null,72.239999999999995,7.35,null,null,null,null,2.31,null,71.52,7.32,null,null,null,null,null,null,null,null,1.51,null,72.95,7.37,2.1800000000000002,null,67.209999999999994,7.26,2.54,null,69.13,7.29,2.56,null,71.98,7.34]
[null,null,null,null,1.74,null,64.25,7.29,1.7,null,64.19,7.34,1.01,null,63.31,7.36,1.61,null,64.47,7.33,1.34,null,67.099999999999994,7.37,1.86,null,63.83,7.29,null,null,null,null,2.5099999999999998,null,68.709999999999994,7.37,1.51,null,65.5,7.34,2.08,null,65.760000000000005,7.3,1.81,null,66.92,7.37,1.18,null,66.540000000000006,7.4,2.44,null,68.75,7.34,null,null,null,null,1.49,null,64.150000000000006,7.32,2.38,null,69.290000000000006,7.32,2.17,null,61.87,7.26,1.35,null,64.3,7.33,1.41,null,63.72,7.31,2.2200000000000002,null,65.319999999999993,7.34,1.74,null,63.2,7.27,2.12,null,63.55,7.25,2.0099999999999998,null,68.77,7.38,1.23,null,64.63,7.32,1.29,null,66.52,7.37,1.4,null,63.77,7.31,2.33,null,61.87,7.25,2.4900000000000002,null,68.08,7.36,null,null,null,null,2.2400000000000002,null,66.819999999999993,7.31,null,null,null,null,null,null,null,null,1.05,null,68.13,7.38,2.4,null,62.22,7.24,1.72,null,64.11,7.29,2.31,null,67.63,7.34]
[]
[null,null,null,null,71,null,0.86,null,44,null,0.87,null,15,null,0.85,null,22,null,0.84,null,43,null,0.86,null,55,null,0.86,null,null,null,null,null,54,null,0.87,null,98,null,0.86,null,75,null,0.86,null,28,null,0.87,null,55,null,0.87,null,67,null,0.87,null,null,null,null,null,13,null,0.86,null,32,null,0.87,null,62,null,0.85,null,40,null,0.86,null,36,null,0.85,null,28,null,0.87,null,32,null,0.85,null,80,null,0.85,null,77,null,0.87,null,51,null,0.85,null,27,null,0.86,null,48,null,0.85,null,56,null,0.85,null,28,null,0.87,null,null,null,null,null,34,null,0.85,null,null,null,null,null,null,null,null,null,26,null,0.86,null,43,null,0.86,null,23,null,0.85,null,29,null,0.87]
[]
[]
["1-in-10"]
["Archbold",null,null,null,"Avon Park",null,null,null,"Belle Glade",null,null,null,"Big Cypress (No Data)",null,null,null,"Clewiston",null,null,null,"Everglades",null,null,null,"Fellsmere (No Data)",null,null,null,"Fort Drum",null,null,null,"Ft. Lauderdale",null,null,null,"Ft. Myers",null,null,null,"Ft. Pierce",null,null,null,"Hialeah",null,null,null,"Homestead",null,null,null,"Hypoluxo",null,null,null,"Immokalee",null,null,null,"Indiantown (No Data)",null,null,null,"Jupiter",null,null,null,"Kissimmee",null,null,null,"La Belle",null,null,null,"Lake Placid (No Data)",null,null,null,"Loxahatchee",null,null,null,"Melbourne (No Data)",null,null,null,"Merritt Island (No Data)",null,null,null,"Miami",null,null,null,"Moore Haven",null,null,null,"Naples",null,null,null,"Okeechobee",null,null,null,"Orlando(No Data)",null,null,null,"Pompano Beach",null,null,null,"Punta Gorda(No Data)",null,null,null,"Stuart",null,null,null,"S-65",null,null,null,"S 140 W",null,null,null,"Tamiami 4",null,null,null,"Titusville (No Data)",null,null,null,"Vero Beach (No Data)",null,null,null,"West Palm Beach"]
["Rain","1-in-10","Temp","Sun","Rain","1-in-10","Temp","Sun","Rain","1-in-10","Temp","Sun","Rain","1-in-10","Temp","Sun","Rain","1-in-10","Temp","Sun","Rain","1-in-10","Temp","Sun","Rain","1-in-10","Temp","Sun","Rain","1-in-10","Temp","Sun","Rain","1-in-10","Temp","Sun","Rain","1-in-10","Temp","Sun","Rain","1-in-10","Temp","Sun","Rain","1-in-10","Temp","Sun","Rain","1-in-10","Temp","Sun","Rain","1-in-10","Temp","Sun","Rain","1-in-10","Temp","Sun","Rain","1-in-10","Temp","Sun","Rain","1-in-10","Temp","Sun","Rain","1-in-10","Temp","Sun","Rain","1-in-10","Temp","Sun","Rain","1-in-10","Temp","Sun","Rain","1-in-10","Temp","Sun","Rain","1-in-10","Temp","Sun","Rain","1-in-10","Temp","Sun","Rain","1-in-10","Temp","Sun","Rain","1-in-10","Temp","Sun","Rain","1-in-10","Temp","Sun","Rain","1-in-10","Temp","Sun","Rain","1-in-10","Temp","Sun","Rain","1-in-10","Temp","Sun","Rain","1-in-10","Temp","Sun","Rain","1-in-10","Temp","Sun","Rain","1-in-10","Temp","Sun","Rain","1-in-10","Temp","Sun","Rain","1-in-10","Temp","Sun","Rain","1-in-10","Temp","Sun","Rain","1-in-10","Temp","Sun","Rain","1-in-10","Temp","Sun"]
[1.91,null,60.61,7.43,2.2400000000000002,null,61.74,7.42,2.2000000000000002,null,63,7.46,null,null,null,null,2.08,null,63.52,7.45,1.69,1.38,65.099999999999994,7.49,null,null,null,null,2.0499999999999998,null,61.77,7.41,2.86,null,66.81,7.49,1.9,null,64.03,7.46,2.48,null,63.29,7.42,2.2799999999999998,null,66.42,7.49,1.72,null,65.77,7.52,3.1,null,65.84,7.46,2.14,null,64.03,7.48,null,null,null,null,3.41,null,64.84,7.44,2.12,null,60.94,7.39,1.95,null,62.94,7.45,null,null,null,null,2.59,null,63,7.46,null,null,null,null,null,null,null,null,2.02,null,67.349999999999994,7.5,1.82,null,62.71,7.44,1.88,null,64.97,7.49,1.76,null,62.03,7.43,null,null,null,null,2.71,null,66.900000000000006,7.48,null,null,null,null,2.4,null,64.84,7.44,2.1800000000000002,null,61.03,7.41,2.0299999999999998,null,66.709999999999994,7.5,1.67,null,66.94,7.5,null,null,null,null,null,null,null,null,2.77,null,65.84,7.47]
[2.2000000000000002,null,61.97,7.09,2.5099999999999998,null,63.41,7.08,1.89,null,63.83,7.11,null,null,null,null,1.98,null,65,7.1,1.63,1.52,66.03,7.12,null,null,null,null,2.72,null,62.9,7.08,2.52,null,67.62,7.12,2,null,65.099999999999994,7.11,2.77,null,64.31,7.09,2.11,null,67.55,7.12,1.86,null,67.45,7.13,2.73,null,66.69,7.11,2.2599999999999998,null,65.239999999999995,7.12,null,null,null,null,2.94,null,65.69,7.1,2.67,null,62.38,7.06,2.11,null,64.62,7.1,null,null,null,null,2.38,null,63.83,7.11,null,null,null,null,null,null,null,null,2.06,null,68.48,7.13,2.04,null,63.86,7.1,1.93,null,65.930000000000007,7.12,2.19,null,63.93,7.09,null,null,null,null,2.14,null,67.55,7.12,null,null,null,null,2.72,null,65.69,7.1,2.91,null,62.72,7.08,1.67,null,68.34,7.12,1.56,null,67.72,7.12,null,null,null,null,null,null,null,null,2.54,null,66.69,7.11]
[3.11,null,66.39,8.3800000000000008,2.82,null,67.61,8.3699999999999992,3.02,null,67.55,8.3800000000000008,null,null,null,null,2.37,null,69.099999999999994,8.3800000000000008,0.95,0.09,69.39,8.3800000000000008,null,null,null,null,3.39,null,66.84,8.3699999999999992,2.9,null,70.709999999999994,8.3800000000000008,1.5,null,68.87,8.3800000000000008,3.23,null,67.94,8.3800000000000008,2.7,null,71.03,8.3800000000000008,2.29,null,69.81,8.39,3.46,null,70.099999999999994,8.3800000000000008,3.09,null,68.77,8.3800000000000008,null,null,null,null,4.2699999999999996,null,69.260000000000005,8.3800000000000008,3.31,null,66.650000000000006,8.3699999999999992,2.02,null,68.23,8.3800000000000008,null,null,null,null,3.33,null,67.55,8.3800000000000008,null,null,null,null,null,null,null,null,2.08,null,71.650000000000006,8.3800000000000008,1.9,null,67.81,8.3800000000000008,0.96,null,69.39,8.3800000000000008,2.89,null,67.84,8.3800000000000008,null,null,null,null,2.94,null,70.77,8.3800000000000008,null,null,null,null,3.57,null,69.260000000000005,8.3800000000000008,3.05,null,67,8.3699999999999992,2.36,null,70.45,8.3800000000000008,1.99,null,70.650000000000006,8.3800000000000008,null,null,null,null,null,null,null,null,3.38,null,70.099999999999994,8.3800000000000008]
[2.33,null,70.400000000000006,8.66,2.52,null,72.2,8.67,2.85,null,70.599999999999994,8.65,null,null,null,null,2.39,null,73.2,8.66,2.2599999999999998,0.98,73.17,8.64,null,null,null,null,2.16,null,70.77,8.67,4.12,null,74.27,8.64,1.9,null,73.13,8.65,3.08,null,72,8.66,3.7,null,74.3,8.64,3.18,null,72.5,8.6300000000000008,3.45,null,73.63,8.65,2.23,null,71.87,8.64,null,null,null,null,3.07,null,72.97,8.66,2.4900000000000002,null,71.2,8.68,2.54,null,72.27,8.66,null,null,null,null,2.99,null,70.599999999999994,8.65,null,null,null,null,null,null,null,null,3.13,null,75.13,8.6300000000000008,2.38,null,71.87,8.66,2.0499999999999998,null,73,8.64,2.78,null,72.13,8.66,null,null,null,null,3.6,null,74.3,8.64,null,null,null,null,2.76,null,72.97,8.66,2.2000000000000002,null,71.599999999999994,8.67,2.33,null,73.73,8.64,2.73,null,73.53,8.64,null,null,null,null,null,null,null,null,3.52,null,73.63,8.65]
[4.2699999999999996,null,75.650000000000006,9.42,4.12,null,77.06,9.44,4.8499999999999996,null,75.290000000000006,9.4,null,null,null,null,4.2699999999999996,null,77.290000000000006,9.4,4.41,2.83,76.94,9.3699999999999992,null,null,null,null,4.67,null,75.48,9.44,6.28,null,77.94,9.3699999999999992,4.0999999999999996,null,77.97,9.4,4.29,null,76.42,9.43,6.37,null,77.97,9.3699999999999992,6.73,null,76.52,9.35,5.26,null,77.81,9.4,4.2300000000000004,null,76.739999999999995,9.3800000000000008,null,null,null,null,5.55,null,76.97,9.41,3.9,null,76.19,9.4700000000000006,4.57,null,77.099999999999994,9.4,null,null,null,null,5.52,null,75.290000000000006,9.4,null,null,null,null,null,null,null,null,6.35,null,78.739999999999995,9.36,4.33,null,76.48,9.41,4.42,null,77.260000000000005,9.3699999999999992,4.29,null,76.81,9.42,null,null,null,null,5.98,null,77.680000000000007,9.3800000000000008,null,null,null,null,4.95,null,76.97,9.42,4.3899999999999997,null,76.77,9.44,4.2699999999999996,null,78.16,9.36,5.44,null,77.48,9.36,null,null,null,null,null,null,null,null,5.65,null,77.81,9.39]
[7.8,null,79.37,9.35,8.27,null,80.63,9.3699999999999992,8.65,null,78.930000000000007,9.32,null,null,null,null,7.2,null,80.430000000000007,9.33,9.75,7.07,80.3,9.2899999999999991,null,null,null,null,7.52,null,79.23,9.3699999999999992,9.02,null,80.900000000000006,9.2899999999999991,9.4,null,81.23,9.32,5.98,null,79.77,9.36,9.31,null,80.8,9.2899999999999991,9.39,null,80.03,9.26,8.2899999999999991,null,80.77,9.32,8.61,null,80.099999999999994,9.3000000000000007,null,null,null,null,7.59,null,80.17,9.34,6.97,null,80.3,9.4,9.3800000000000008,null,80.33,9.33,null,null,null,null,8.9499999999999993,null,78.930000000000007,9.32,null,null,null,null,null,null,null,null,7.84,null,81.23,9.2799999999999994,7.57,null,80,9.34,8.17,null,80.569999999999993,9.2899999999999991,7.35,null,80.17,9.35,null,null,null,null,7.75,null,80.53,9.3000000000000007,null,null,null,null,6.58,null,80.17,9.35,7.9,null,80.23,9.3699999999999992,8.3800000000000008,null,82.07,9.2799999999999994,9.35,null,80.930000000000007,9.2799999999999994,null,null,null,null,null,null,null,null,7.97,null,80.77,9.32]
[6.94,null,80.42,9.5399999999999991,8.0299999999999994,null,81.900000000000006,9.56,7.81,null,80.319999999999993,9.52,null,null,null,null,6.28,null,81.84,9.52,8.2100000000000009,6.93,81.77,9.49,null,null,null,null,7.46,null,81,9.56,6.39,null,82,9.49,8.6999999999999993,null,82.53,9.52,5.66,null,81,9.5500000000000007,7.07,null,82,9.49,7.95,null,81.45,9.4700000000000006,5.75,null,82.29,9.52,7.48,null,81.260000000000005,9.5,null,null,null,null,5.41,null,81.680000000000007,9.5299999999999994,7.46,null,81.650000000000006,9.59,8.19,null,81.16,9.52,null,null,null,null,7.94,null,80.319999999999993,9.52,null,null,null,null,null,null,null,null,5.44,null,82.68,9.48,7.04,null,81.319999999999993,9.5299999999999994,8.36,null,81.87,9.49,6.55,null,81.61,9.5399999999999991,null,null,null,null,6.41,null,82.03,9.5,null,null,null,null,6.53,null,81.680000000000007,9.5399999999999991,7.7,null,81.16,9.56,5.72,null,83.9,9.48,8.06,null,82.77,9.48,null,null,null,null,null,null,null,null,6.32,null,82.29,9.51]
[7.15,null,80.94,9.15,7.5,null,82,9.16,7.95,null,80.680000000000007,9.1300000000000008,null,null,null,null,6.38,null,82,9.1300000000000008,7.79,6.93,82,9.11,null,null,null,null,6.8,null,81,9.16,6.9,null,82.26,9.11,8.6,null,82.9,9.1300000000000008,5.82,null,81.349999999999994,9.15,8.25,null,82.16,9.11,8.27,null,82,9.09,6.57,null,82.55,9.1300000000000008,7.35,null,81.739999999999995,9.1199999999999992,null,null,null,null,6.78,null,82.06,9.14,6.76,null,81.84,9.18,7.85,null,81.77,9.1300000000000008,null,null,null,null,7.32,null,80.680000000000007,9.1300000000000008,null,null,null,null,null,null,null,null,6.29,null,82.84,9.1300000000000008,6.73,null,81.709999999999994,9.14,8.18,null,82,9.11,6.65,null,81.709999999999994,9.15,null,null,null,null,6.73,null,82.42,9.1199999999999992,null,null,null,null,5.71,null,82.06,9.14,6.58,null,81.48,9.16,6.71,null,84,9.1300000000000008,7.26,null,83.06,9.1300000000000008,null,null,null,null,null,null,null,null,6.73,null,82.55,9.1199999999999992]
[6.8,null,79.599999999999994,8.32,7.15,null,80.47,8.32,7.98,null,79.430000000000007,8.32,null,null,null,null,5.92,null,81.17,8.32,9.07,7.85,81.5,8.32,null,null,null,null,6.48,null,79.63,8.32,8.2100000000000009,null,81.37,8.32,8.4,null,81.599999999999994,8.32,8.0299999999999994,null,80.3,8.32,8.98,null,81.3,8.32,10.27,null,81.069999999999993,8.31,7.78,null,81.3,8.32,6.71,null,80.67,9.32,null,null,null,null,8.44,null,81.2,8.32,6.49,null,80.069999999999993,8.32,6.82,null,80.430000000000007,8.32,null,null,null,null,9.7100000000000009,null,79.430000000000007,8.32,null,null,null,null,null,null,null,null,8.3000000000000007,null,81.67,8.32,6.97,null,80.5,8.32,8.69,null,81.53,8.32,6.37,null,80.47,8.32,null,null,null,null,7.99,null,81.099999999999994,8.32,null,null,null,null,8.0500000000000007,null,81.2,8.32,6.3,null,79.97,8.32,5.48,null,83.37,8.32,8.1999999999999993,null,82.23,8.32,null,null,null,null,null,null,null,null,8.81,null,81.3,8.32]
[3.24,null,74.37,8.0399999999999991,3.59,null,74.97,8.0299999999999994,4.34,null,74.94,8.0500000000000007,null,null,null,null,3.46,null,76.58,8.0399999999999991,4.12,3.13,77.290000000000006,8.06,null,null,null,null,3.92,null,74.61,8.0299999999999994,8.4,null,77.77,8.06,3.5,null,76.58,8.0500000000000007,6.72,null,75.97,8.0299999999999994,7.39,null,77.39,8.06,7.18,null,77.45,8.07,7.73,null,77.45,8.0500000000000007,2.9,null,76,8.06,null,null,null,null,8.42,null,76.900000000000006,8.0399999999999991,3.27,null,74.77,8.01,3.8,null,75.42,8.0399999999999991,null,null,null,null,6.44,null,74.94,8.0500000000000007,null,null,null,null,null,null,null,null,8.3800000000000008,null,78.099999999999994,8.07,3.47,null,75.61,8.0399999999999991,4.09,null,77.03,8.06,4.0999999999999996,null,75.349999999999994,8.0399999999999991,null,null,null,null,7.71,null,77.39,8.06,null,null,null,null,6.69,null,76.900000000000006,8.0399999999999991,3.3,null,74.099999999999994,8.0299999999999994,2.4700000000000002,null,79.23,8.06,4.72,null,78.55,8.06,null,null,null,null,null,null,null,null,6.86,null,77.45,8.0500000000000007]
[1.63,null,68.400000000000006,7.31,1.71,null,68.17,7.3,2.2200000000000002,null,68.87,7.33,null,null,null,null,1.93,null,70.569999999999993,7.33,1.46,1.18,71.23,7.36,null,null,null,null,1.79,null,68.569999999999993,7.29,3.96,null,72.63,7.36,1.5,null,69.83,7.33,2.95,null,69.8,7.3,3.52,null,72.2,7.36,2.15,null,71.930000000000007,7.38,3.81,null,71.87,7.33,1.95,null,67.2,7.35,null,null,null,null,3.61,null,71.099999999999994,7.32,1.96,null,67.930000000000007,7.27,1.73,null,68.97,7.33,null,null,null,null,3.18,null,68.87,7.33,null,null,null,null,null,null,null,null,2.8,null,73.13,7.37,1.73,null,69,7.32,1.56,null,71.2,7.36,1.91,null,69.13,7.31,null,null,null,null,3.6,null,72.400000000000006,7.35,null,null,null,null,2.83,null,71.099999999999994,7.32,2.14,null,67.17,7.29,1.93,null,74,7.37,2.02,null,73,7.37,null,null,null,null,null,null,null,null,3.9,null,71.87,7.34]
[1.64,null,62.65,7.31,1.76,null,63.29,7.29,1.72,null,64.319999999999993,7.34,null,null,null,null,1.67,null,65.260000000000005,7.33,1.45,1.0900000000000001,66.739999999999995,7.37,null,null,null,null,1.78,null,63,7.29,2.52,null,68.42,7.37,1.5,null,65.290000000000006,7.34,2.0699999999999998,null,64.94,7.3,1.85,null,67.77,7.37,1.35,null,67.290000000000006,7.4,2.61,null,67.349999999999994,7.34,1.51,null,65.45,7.36,null,null,null,null,2.4700000000000002,null,66.61,7.32,2.08,null,62.48,7.26,1.72,null,64.650000000000006,7.33,null,null,null,null,2.21,null,64.319999999999993,7.34,null,null,null,null,null,null,null,null,2.0499999999999998,null,68.87,7.38,1.62,null,64.260000000000005,7.32,1.32,null,66.55,7.37,1.58,null,63.65,7.31,null,null,null,null,2.2999999999999998,null,68.03,7.36,null,null,null,null,2.56,null,66.61,7.31,1.84,null,62.16,7.29,1.38,null,68.650000000000006,7.38,1.19,null,68.23,7.38,null,null,null,null,null,null,null,null,2.52,null,67.349999999999994,7.34]
[null,null,29,null,null,null,67,null,null,null,68,null,null,null," ",null,null,null,50,null,null,null,67,null,null,null,null,null,null,null,50,null,null,null,50,null,null,null,50,null,null,null,67,null,null,null,50,null,null,null,72,null,null,null,97,null,null,null,28,null,null,null,null,null,null,null,50,null,null,null,50,null,null,null,57,null,null,null,null,null,null,null,68,null,null,null,null,null,null,null,null,null,null,null,50,null,null,null,67,null,null,null,50,null,null,null,50,null,null,null,null,null,null,null,50,null,null,null,null,null,null,null,50,null,null,null,50,null,null,null,20,null,null,null,50,null,null,null,null,null,null,null,null,null,null,null,50]
[68,null,0.83,null,93,null,0.84,null,72,null,0.84,null," ",null," ",null,46,null,0.83,null,57,null,0.83,null,null,null,null,null,50,null,0.85,null,83,null,0.82,null,57,null,0.84,null,96,null,0.83,null,56,null,0.81,null,72,null,0.84,null,97,null,0.81,null,37,null,0.82,null," ",null," ",null,97,null,0.81,null,94,null,0.83,null,57,null,0.86,null,null,null,null,null,47,null,0.83,null,null,null,null,null,null,null,null,null,79,null,0.78,null,58,null,0.83,null,55,null,0.83,null,73,null,0.82,null,null,null,null,null,55,null,0.82,null,null,null,null,null,60,null,0.81,null,30,null,0.85,null,23,null,0.83,null,56,null,0.83,null," ",null," ",null," ",null," ",null,58,null,0.8]
[]
[]
[]
["Mean Rainfall",null,"=","Rain"]
["2-in-10 Year Rainfall",null,"=","2-in-10"]
["1-in-10 Year Rainfall",null,"=","1-in-10"]
["Mean Temperature (F)",null,"=","Temp"]
["Annual Daylight (%)",null,"=","Sun"]

{"sheet":"crop k's","index":9,"n_rows":192,"n_cols":28,"rows_kept":192,"cut":false,"hidden":true,"merged":[]}
["Perennials"]
["a",5,10,11,12,13,14,15,18,20,21,22,23,24,25]
["b","Nursery","Sugarcane","Alfalfa","Avocado","Citrus","Grapes","Turf Grass","Blueberries","Pasture","Papaya","Carambola","Tropical Fruit","Mangoes","Palm Trees"]
["a",0.49,0.39,0.63,0.27,0.63,0.2,0.49,0.63,0.46,0.63,0.63,0.63,0.27,0.49]
["b",0.56999999999999995,0.3,0.73,0.42,0.66,0.24,0.56999999999999995,0.66,0.6,0.66,0.66,0.66,0.42,0.56999999999999995]
["c",0.73,0.53,0.86,0.57999999999999996,0.68,0.38,0.73,0.68,0.63,0.68,0.68,0.68,0.57999999999999996,0.73]
["d",0.85,0.61,0.99,0.7,0.7,0.6,0.85,0.7,0.68,0.7,0.7,0.7,0.7,0.85]
["e",0.9,0.7,1.08,0.78,0.71,0.71,0.9,0.71,0.7,0.71,0.71,0.71,0.78,0.9]
["f",0.92,0.79,1.1299999999999999,0.81,0.71,0.8,0.92,0.71,0.53,0.71,0.71,0.71,0.81,0.92]
["g",0.92,0.79,1.1100000000000001,0.77,0.71,0.8,0.92,0.71,0.56000000000000005,0.71,0.71,0.71,0.77,0.92]
["h",0.91,0.84,1.06,0.71,0.71,0.76,0.91,0.71,0.57999999999999996,0.71,0.71,0.71,0.71,0.91]
["I",0.87,0.73,0.99,0.63,0.7,0.61,0.87,0.7,0.52,0.7,0.7,0.7,0.63,0.87]
["j",0.79,0.88,0.91,0.54,0.68,0.5,0.79,0.68,0.53,0.68,0.68,0.68,0.54,0.79]
["k",0.67,0.72,0.78,0.43,0.67,0.35,0.67,0.67,0.49,0.67,0.67,0.67,0.43,0.67]
["l",0.55000000000000004,0.69,0.64,0.3,0.64,0.23,0.55000000000000004,0.64,0.44,0.64,0.64,0.64,0.3,0.55000000000000004]
[null,"Y","Y","Y","Y","Y","Y","Y","Y","Y","Y","Y","Y","Y","Y"]
["Annuals"]
["a",51,52,53,54,55,56,57,58,59,60,61,62,64,65,66,69]
["b","Dry Beans","Green Bean","Grain Corn","Silage Corn","Sweet Corn","Melons","Peas","Potato","Soybeans","Tomato","Small Vegetables","Winter Wheat","Peppers","Hay","Strawberries","Sorghum"]
["a",0.54,0.53,0.46,0.45,0.47,0.45,0.54,0.36,0.22,0.45,0.33,0.28000000000000003,0.5,0.45,0.5,0.3,null,62,"rice"]
["b",0.59,0.55000000000000004,0.5,0.47,0.5,0.48,0.59,0.41,0.26,0.46,0.39,0.3,0.51,0.48,0.61,0.32,null," ","no winter wheat"]
["c",0.65,0.57999999999999996,0.53,0.5,0.54,0.52,0.65,0.45,0.3,0.47,0.47,0.34,0.52,0.52,0.73,0.35]
["d",0.72,0.61,0.57999999999999996,0.54,0.57999999999999996,0.56000000000000005,0.72,0.51,0.33,0.48,0.56000000000000005,0.39,0.54,0.56000000000000005,0.82,0.47]
["e",0.81,0.64,0.64,0.59,0.64,0.61,0.8,0.59,0.37,0.51,0.64,0.44,0.55000000000000004,0.61,0.92,0.72]
["f",0.9,0.68,0.71,0.64,0.72,0.66,0.88,0.72,0.41,0.56000000000000005,0.69,0.52,0.6,0.66,0.98,0.83]
["g",0.96,0.73,0.82,0.71,0.82,0.71,0.97,0.85,0.48,0.65,0.74,0.57999999999999996,0.65,0.71,1.04,0.93]
["h",1.03,0.79,0.92,0.8,0.91,0.75,1.03,0.97,0.55000000000000004,0.76,0.78,0.65,0.74,0.75,1.06,1.02]
["I",1.08,0.84,1,0.9,0.99,0.8,1.07,1.08,0.63,0.87,0.8,0.72,0.83,0.8,1.0900000000000001,1.08]
["j",1.1100000000000001,0.89,1.05,0.98,1.05,0.82,1.1100000000000001,1.17,0.72,0.95,0.82,0.78,0.9,0.82,1.1100000000000001,1.08]
["k",1.1200000000000001,0.94,1.07,1.03,1.07,0.82,1.1200000000000001,1.25,0.84,1.01,0.83,0.85,0.95,0.82,1.1200000000000001,1.04]
["l",1.1100000000000001,0.98,1.08,1.06,1.08,0.8,1.1200000000000001,1.31,0.92,1.03,0.83,0.91,0.93,0.8,1.1299999999999999,1]
["m",1.08,1.02,1.07,1.07,1.08,0.79,1.1100000000000001,1.35,0.98,1.02,0.82,0.97,0.91,0.79,1.1499999999999999,0.93]
["n",1.03,1.05,1.06,1.08,1.07,0.77,1.1000000000000001,1.37,1.02,0.98,0.8,1.02,0.9,0.77,1.1399999999999999,0.88]
["o",0.96,1.08,1.03,1.07,1.07,0.76,1.08,1.37,1.02,0.95,0.76,1.08,0.88,0.76,1.1200000000000001,0.82]
["p",0.9,1.1000000000000001,1,1.06,1.06,0.75,1.06,1.36,0.93,0.9,0.73,1.1299999999999999,0.86,0.75,1.1100000000000001,0.76]
["q",0.83,1.1100000000000001,0.97,1.04,1.05,0.73,1.04,1.34,0.83,0.85,0.66,1.18,0.85,0.73,1.08,0.7]
["r",0.75,1.1200000000000001,0.93,1.02,1.03,0.71,1.01,1.3,0.77,0.8,0.57999999999999996,1.22,0.83,0.71,1.02,0.64]
["s",0.67,1.1200000000000001,0.89,1,1.02,0.69,0.97,1.27,0.72,0.75,0.48,1.24,0.81,0.69,0.96,0.6]
["t",0.6,1.1100000000000001,0.85,0.96,1,0.67,0.96,1.23,0.68,0.7,0.38,1.32,0.8,0.67,0.8,0.55000000000000004]
[null,"Y","Y","Y","Y","Y","Y","Y","Y","Y","Y","Y",null,"N","Y","N","Y","ASR Database active or in-active"]
["Annual Crop being calculated/Growing Season Length"]
[]
["a",{"$f":"IF(InputControl!$B$57>=51,VLOOKUP(\"a\",$A$18:U$19,$D$104,FALSE),\"Not an Annual Crop\")","v":"Not an Annual Crop"}]
["b",{"$f":"IF(InputControl!$B$57>=51,VLOOKUP(\"b\",$A$18:U$19,$D$104,FALSE),\"No Crop ---\")","v":"No Crop ---"},null,"    1 month season","    2 month season","    3 month season","    4 month season","    5 month season","    6 month season","    7 month season","    8 month season","    9 month season","    10 month season","    11 month season","    12 month season"]
["a",{"$f":"IF(InputControl!$B$57>=51,VLOOKUP(\"a\",$A$20:$U$39,$D$104,FALSE),0)","v":0},"a",{"$f":"(SUM($B$45:$B$64))/(20/1)","v":0},{"$f":"(SUM($B$45:$B$54))/(20/2)","v":0},{"$f":"(SUM($B$45:$B$50)+($B$51*2/3))/(20/3)","v":0},{"$f":"(SUM($B$45:$B$49))/(20/4)","v":0},{"$f":"(SUM($B$45:$B$48))/(20/5)","v":0},{"$f":"(SUM($B$45:$B$47)+($B$48*1/3))/(20/6)","v":0},{"$f":"(SUM($B$45:$B$46)+($B$47*6/7))/(20/7)","v":0},{"$f":"(SUM($B$45:$B$46)+($B$47*4/8))/(20/8)","v":0},{"$f":"(SUM($B$45:$B$46)+($B$47*2/9))/(20/9)","v":0},{"$f":"(SUM($B$45:$B$46))/(20/10)","v":0},{"$f":"(($B$45)+($B$46*9/11))/(20/11)","v":0},{"$f":"(($B$45)+($B$46*8/12))/(20/12)","v":0},"a",{"$f":"IF(InputControl!$B$57>=51,VLOOKUP(\"a\",$C$45:$O$56,InputControl!$C$113,FALSE),0)","v":0}]
["b",{"$f":"IF(InputControl!$B$57>=51,VLOOKUP(\"b\",$A$20:$U$39,$D$104,FALSE),0)","v":0},"b",0,{"$f":"(SUM($B$55:$B$64))/(20/2)","v":0},{"$f":"(($B$51*1/3)+SUM($B$52:$B$57)+($B$58*1/3))/(20/3)","v":0},{"$f":"(SUM($B$50:$B$54))/(20/4)","v":0},{"$f":"(SUM($B$49:$B$52))/(20/5)","v":0},{"$f":"(($B$48*2/3)+SUM($B$49:$B$50)+($B$51*2/3))/(20/6)","v":0},{"$f":"(($B$47*1/7)+SUM($B$48:$B$49)+($B$50*5/7))/(20/7)","v":0},{"$f":"(($B$47*4/8)+SUM($B$48:$B$49))/(20/8)","v":0},{"$f":"(($B$47*7/9)+($B$48)+($B$49*4/9))/(20/9)","v":0},{"$f":"(SUM($B$47:$B$48))/(20/10)","v":0},{"$f":"(($B$46*2/11)+($B$47)+($B$48*7/11))/(20/11)","v":0},{"$f":"(($B$46*4/12)+($B$47)+($B$48*4/12))/(20/12)","v":0},"b",{"$f":"IF(InputControl!$B$57>=51,VLOOKUP(\"b\",$C$45:$O$56,InputControl!$C$113,FALSE),0)","v":0}]
["c",{"$f":"IF(InputControl!$B$57>=51,VLOOKUP(\"c\",$A$20:$U$39,$D$104,FALSE),0)","v":0},"c",0,0,{"$f":"(($B$58*2/3)+SUM($B$59:$B$64))/(20/3)","v":0},{"$f":"(SUM($B$55:$B$59))/(20/4)","v":0},{"$f":"(SUM($B$53:$B$56))/(20/5)","v":0},{"$f":"(($B$51*1/3)+SUM($B$52:$B$54))/(20/6)","v":0},{"$f":"(($B$50*2/7)+SUM($B$51:$B$52)+($B$53*4/7))/(20/7)","v":0},{"$f":"(SUM($B$50:$B$51)+($B$52*4/8))/(20/8)","v":0},{"$f":"(($B$49*5/9)+($B$50)+($B$51*6/9))/(20/9)","v":0},{"$f":"(SUM($B$49:$B$50))/(20/10)","v":0},{"$f":"(($B$48*4/11)+($B$49)+($B$50*5/11))/(20/11)","v":0},{"$f":"(($B$48*8/12)+($B$49))/(20/12)","v":0},"c",{"$f":"IF(InputControl!$B$57>=51,VLOOKUP(\"c\",$C$45:$O$56,InputControl!$C$113,FALSE),0)","v":0}]
["d",{"$f":"IF(InputControl!$B$57>=51,VLOOKUP(\"d\",$A$20:$U$39,$D$104,FALSE),0)","v":0},"d",0,0,0,{"$f":"(SUM($B$60:$B$64))/(20/4)","v":0},{"$f":"(SUM($B$57:$B$60))/(20/5)","v":0},{"$f":"(SUM($B$55:$B$57)+($B$58*1/3))/(20/6)","v":0},{"$f":"(($B$53*3/7)+SUM($B$54:$B$55)+($B$56*3/7))/(20/7)","v":0},{"$f":"(($B$52*4/8)+SUM($B$53:$B$54))/(20/8)","v":0},{"$f":"(($B$51*3/9)+($B$52)+($B$53*8/9))/(20/9)","v":0},{"$f":"(SUM($B$51:$B$52))/(20/10)","v":0},{"$f":"(($B$50*6/11)+($B$51)+($B$52*3/11))/(20/11)","v":0},{"$f":"(($B$50)+($B$51*8/12))/(20/12)","v":0},"d",{"$f":"IF(InputControl!$B$57>=51,VLOOKUP(\"d\",$C$45:$O$56,InputControl!$C$113,FALSE),0)","v":0}]
["e",{"$f":"IF(InputControl!$B$57>=51,VLOOKUP(\"e\",$A$20:$U$39,$D$104,FALSE),0)","v":0},"e",0,0,0,0,{"$f":"(SUM($B$61:$B$64))/(20/5)","v":0},{"$f":"(($B$58*2/3)+SUM($B$59:$B$60)+($B$61*2/3))/(20/6)","v":0},{"$f":"(($B$56*4/7)+SUM($B$57:$B$58)+($B$59*2/7))/(20/7)","v":0},{"$f":"(SUM($B$55:$B$56)+($B$57*4/8))/(20/8)","v":0},{"$f":"(($B$53*1/9)+SUM($B$54:$B$55)+($B$56*1/9))/(20/9)","v":0},{"$f":"(SUM($B$53:$B$54))/(20/10)","v":0},{"$f":"(($B$52*8/11)+($B$53)+($B$54*1/11))/(20/11)","v":0},{"$f":"(($B$51*4/12)+($B$52)+($B$53*4/12))/(20/12)","v":0},"e",{"$f":"IF(InputControl!$B$57>=51,VLOOKUP(\"e\",$C$45:$O$56,InputControl!$C$113,FALSE),0)","v":0}]
["f",{"$f":"IF(InputControl!$B$57>=51,VLOOKUP(\"f\",$A$20:$U$39,$D$104,FALSE),0)","v":0},"f",0,0,0,0,0,{"$f":"(($B$61*1/3)+SUM($B$62:$B$64))/(20/6)","v":0},{"$f":"(($B$59*5/7)+SUM($B$60:$B$61)+($B$62*1/7))/(20/7)","v":0},{"$f":"(($B$57*4/8)+SUM($B$58:$B$59))/(20/8)","v":0},{"$f":"(($B$56*8/9)+($B$57)+($B$58*3/9))/(20/9)","v":0},{"$f":"(SUM($B$55:$B$56))/(20/10)","v":0},{"$f":"(($B$54*10/11)+($B$55*10/11))/(20/11)","v":0},{"$f":"(($B$53*8/12)+($B$54))/(20/12)","v":0},"f",{"$f":"IF(InputControl!$B$57>=51,VLOOKUP(\"f\",$C$45:$O$56,InputControl!$C$113,FALSE),0)","v":0}]
["g",{"$f":"IF(InputControl!$B$57>=51,VLOOKUP(\"g\",$A$20:$U$39,$D$104,FALSE),0)","v":0},"g",0,0,0,0,0,0,{"$f":"(($B$62*6/7)+SUM($B$63:$B$64))/(20/7)","v":0},{"$f":"(SUM($B$60:$B$61)+($B$62*4/8))/(20/8)","v":0},{"$f":"(($B$58*6/9)+($B$59)+($B$60*5/9))/(20/9)","v":0},{"$f":"(SUM($B$57:$B$58))/(20/10)","v":0},{"$f":"(($B$55*1/11)+($B$56)+($B$57*8/11))/(20/11)","v":0},{"$f":"(($B$55)+($B$56*8/12))/(20/12)","v":0},"g",{"$f":"IF(InputControl!$B$57>=51,VLOOKUP(\"g\",$C$45:$O$56,InputControl!$C$113,FALSE),0)","v":0}]
["h",{"$f":"IF(InputControl!$B$57>=51,VLOOKUP(\"h\",$A$20:$U$39,$D$104,FALSE),0)","v":0},"h",0,0,0,0,0,0,0,{"$f":"(($B$62*4/8)+SUM($B$63:$B$64))/(20/8)","v":0},{"$f":"(($B$60*4/9)+($B$61)+($B$62*7/9))/(20/9)","v":0},{"$f":"(SUM($B$59:$B$60))/(20/10)","v":0},{"$f":"(($B$57*3/11)+($B$58)+($B$59*6/11))/(20/11)","v":0},{"$f":"(($B$56*4/12)+($B$57)+($B$58*4/12))/(20/12)","v":0},"h",{"$f":"IF(InputControl!$B$57>=51,VLOOKUP(\"h\",$C$45:$O$56,InputControl!$C$113,FALSE),0)","v":0}]
["I",{"$f":"IF(InputControl!$B$57>=51,VLOOKUP(\"i\",$A$20:$U$39,$D$104,FALSE),0)","v":0},"I",0,0,0,0,0,0,0,0,{"$f":"(($B$62*2/9)+SUM($B$63:$B$64))/(20/9)","v":0},{"$f":"(SUM($B$61:$B$62))/(20/10)","v":0},{"$f":"(($B$59*5/11)+($B$60)+($B$61*4/11))/(20/11)","v":0},{"$f":"(($B$58*8/12)+($B$59))/(20/12)","v":0},"I",{"$f":"IF(InputControl!$B$57>=51,VLOOKUP(\"i\",$C$45:$O$56,InputControl!$C$113,FALSE),0)","v":0}]
["j",{"$f":"IF(InputControl!$B$57>=51,VLOOKUP(\"j\",$A$20:$U$39,$D$104,FALSE),0)","v":0},"j",0,0,0,0,0,0,0,0,0,{"$f":"(SUM($B$63:$B$64))/(20/10)","v":0},{"$f":"(($B$61*7/11)+($B$62)+($B$63*2/11))/(20/11)","v":0},{"$f":"(($B$60)+($B$61*8/12))/(20/12)","v":0},"j",{"$f":"IF(InputControl!$B$57>=51,VLOOKUP(\"j\",$C$45:$O$56,InputControl!$C$113,FALSE),0)","v":0}]
["k",{"$f":"IF(InputControl!$B$57>=51,VLOOKUP(\"k\",$A$20:$U$39,$D$104,FALSE),0)","v":0},"k",0,0,0,0,0,0,0,0,0,0,{"$f":"(($B$63*9/11)+($B$64))/(20/11)","v":0},{"$f":"(($B$61*4/12)+($B$62)+($B$63*4/12))/(20/12)","v":0},"k",{"$f":"IF(InputControl!$B$57>=51,VLOOKUP(\"k\",$C$45:$O$56,InputControl!$C$113,FALSE),0)","v":0}]
["l",{"$f":"IF(InputControl!$B$57>=51,VLOOKUP(\"l\",$A$20:$U$39,$D$104,FALSE),0)","v":0},"l",0,0,0,0,0,0,0,0,0,0,0,{"$f":"(($B$63*8/12)+($B$64))/(20/12)","v":0},"l",{"$f":"IF(InputControl!$B$57>=51,VLOOKUP(\"l\",$C$45:$O$56,InputControl!$C$113,FALSE),0)","v":0}]
["m",{"$f":"IF(InputControl!$B$57>=51,VLOOKUP(\"m\",$A$20:$U$39,$D$104,FALSE),0)","v":0}]
["n",{"$f":"IF(InputControl!$B$57>=51,VLOOKUP(\"n\",$A$20:$U$39,$D$104,FALSE),0)","v":0}]
["o",{"$f":"IF(InputControl!$B$57>=51,VLOOKUP(\"o\",$A$20:$U$39,$D$104,FALSE),0)","v":0}]
["p",{"$f":"IF(InputControl!$B$57>=51,VLOOKUP(\"p\",$A$20:$U$39,$D$104,FALSE),0)","v":0}]
["q",{"$f":"IF(InputControl!$B$57>=51,VLOOKUP(\"q\",$A$20:$U$39,$D$104,FALSE),0)","v":0}]
["r",{"$f":"IF(InputControl!$B$57>=51,VLOOKUP(\"r\",$A$20:$U$39,$D$104,FALSE),0)","v":0}]
["s",{"$f":"IF(InputControl!$B$57>=51,VLOOKUP(\"s\",$A$20:$U$39,$D$104,FALSE),0)","v":0},null,null,null,null,null,null,null,null,null,null,null,null,null,null,null,"ERROR",{"$f":"IF(OR(AND(InputControl!$B$57>50,S67<>\"\"),AND(InputControl!$B$57>50,S68<>\"\"),S69<>\"\",S70<>\"\",S71<>\"\",S72<>\"\"),S73,\"\")","v":""}]
["t",{"$f":"IF(InputControl!$B$57>=51,VLOOKUP(\"t\",$A$20:$U$39,$D$104,FALSE),0)","v":0},null,null,null,null,null,null,null,null,null,null,null,null,null,null,null,"ANNUAL GOOD",{"$f":"IF(OR(S67<>\"\",S68<>\"\",S69<>\"\",S70<>\"\",S71<>\"\",S72<>\"\"),S68,S84)","v":""}]
[null,null,null,null,null,null,null,null,null,null,null,null,null,null,null,null,null,"PERENNIAL GOOD",{"$f":"IF(OR(S69<>\"\",S70<>\"\",S71<>\"\",S72<>\"\"),\"\",S84)","v":"CALCULATION GOOD"}]
["Monthly Coefficients Being Used for Annual Crops"]
[null,null,null,null,null,null,null,null,null,null,null,null,null,null,null,null,null,"Annual Answer",{"$f":"IF(OR(C99>1,D99>1,E99>1,F99>1,G99>1,H99>1,I99>1,J99>1,K99>1,L99>1,M99>1,N99>1),S79,\"\")","v":"The selected crops plantings overlap with the selected crop's growing season length"}]
[null,null,"Jan","Feb","Mar","Apr","May","Jun","Jul","Aug","Sep","Oct","Nov","Dec","Totals","Totals",null,"Annual Answer",{"$f":"IF(AA99>12,S80,\"\")","v":""}]
[null,null,{"$f":"IF(InputControl!$A$141=TRUE,$Q$45,0)","v":0},{"$f":"IF(InputControl!$A$142=TRUE,$Q$56,0)","v":0},{"$f":"IF(InputControl!$A$143=TRUE,$Q$55,0)","v":0},{"$f":"IF(InputControl!$A$144=TRUE,$Q$54,0)","v":0},{"$f":"IF(InputControl!$A$145=TRUE,$Q$53,0)","v":0},{"$f":"IF(InputControl!$A$146=TRUE,$Q$52,0)","v":0},{"$f":"IF(InputControl!$A$147=TRUE,$Q$51,0)","v":0},{"$f":"IF(InputControl!$A$148=TRUE,$Q$50,0)","v":0},{"$f":"IF(InputControl!$A$149=TRUE,$Q$49,0)","v":0},{"$f":"IF(InputControl!$A$150=TRUE,$Q$48,0)","v":0},{"$f":"IF(InputControl!$A$151=TRUE,$Q$47,0)","v":0},{"$f":"IF(InputControl!$A$152=TRUE,$Q$46,0)","v":0},{"$f":"SUM(C69:N69)","v":0},{"$f":"IF(OR(C99>1,D99>1,E99>1,F99>1,G99>1,H99>1,I99>1,J99>1,K99>1,L99>1,M99>1,N99>1,AA99>12),S77,SUM(C69:N69))","v":0},null,"Not Annual Answer",{"$f":"IF(D159<>0,\"\",S81)","v":""}]
[null,null,{"$f":"IF(InputControl!$A$141=TRUE,$Q$46,0)","v":0},{"$f":"IF(InputControl!$A$142=TRUE,$Q$45,0)","v":0},{"$f":"IF(InputControl!$A$143=TRUE,$Q$56,0)","v":0},{"$f":"IF(InputControl!$A$144=TRUE,$Q$55,0)","v":0},{"$f":"IF(InputControl!$A$145=TRUE,$Q$54,0)","v":0},{"$f":"IF(InputControl!$A$146=TRUE,$Q$53,0)","v":0},{"$f":"IF(InputControl!$A$147=TRUE,$Q$52,0)","v":0},{"$f":"IF(InputControl!$A$148=TRUE,$Q$51,0)","v":0},{"$f":"IF(InputControl!$A$149=TRUE,$Q$50,0)","v":0},{"$f":"IF(InputControl!$A$150=TRUE,$Q$49,0)","v":0},{"$f":"IF(InputControl!$A$151=TRUE,$Q$48,0)","v":0},{"$f":"IF(InputControl!$A$152=TRUE,$Q$47,0)","v":0},{"$f":"SUM(C70:N70)","v":0},{"$f":"IF(OR(C99>1,D99>1,E99>1,F99>1,G99>1,H99>1,I99>1,J99>1,K99>1,L99>1,M99>1,N99>1,AA99>12),S77,SUM(C70:N70))","v":0},null,"Not Annual Answer",{"$f":"IF(X71<>0,\"\",S82)","v":""}]
[null,null,{"$f":"IF(InputControl!$A$141=TRUE,$Q$47,0)","v":0},{"$f":"IF(InputControl!$A$142=TRUE,$Q$46,0)","v":0},{"$f":"IF(InputControl!$A$143=TRUE,$Q$45,0)","v":0},{"$f":"IF(InputControl!$A$144=TRUE,$Q$56,0)","v":0},{"$f":"IF(InputControl!$A$145=TRUE,$Q$55,0)","v":0},{"$f":"IF(InputControl!$A$146=TRUE,$Q$54,0)","v":0},{"$f":"IF(InputControl!$A$147=TRUE,$Q$53,0)","v":0},{"$f":"IF(InputControl!$A$148=TRUE,$Q$52,0)","v":0},{"$f":"IF(InputControl!$A$149=TRUE,$Q$51,0)","v":0},{"$f":"IF(InputControl!$A$150=TRUE,$Q$50,0)","v":0},{"$f":"IF(InputControl!$A$151=TRUE,$Q$49,0)","v":0},{"$f":"IF(InputControl!$A$152=TRUE,$Q$48,0)","v":0},0,{"$f":"IF(OR(C99>1,D99>1,E99>1,F99>1,G99>1,H99>1,I99>1,J99>1,K99>1,L99>1,M99>1,N99>1,AA99>12),S77,SUM(C71:N71))","v":0},null,"Not Annual Answer",{"$f":"IF(X71=\"NO DATA\",S78,\"\")","v":""},null,null,null,null,{"$f":"IFERROR('Blaney Calc'!$C$4,\"NO DATA\")","v":62.03}]
[null,null,{"$f":"IF(InputControl!$A$141=TRUE,$Q$48,0)","v":0},{"$f":"IF(InputControl!$A$142=TRUE,$Q$47,0)","v":0},{"$f":"IF(InputControl!$A$143=TRUE,$Q$46,0)","v":0},{"$f":"IF(InputControl!$A$144=TRUE,$Q$45,0)","v":0},{"$f":"IF(InputControl!$A$145=TRUE,$Q$56,0)","v":0},{"$f":"IF(InputControl!$A$146=TRUE,$Q$55,0)","v":0},{"$f":"IF(InputControl!$A$147=TRUE,$Q$54,0)","v":0},{"$f":"IF(InputControl!$A$148=TRUE,$Q$53,0)","v":0},{"$f":"IF(InputControl!$A$149=TRUE,$Q$52,0)","v":0},{"$f":"IF(InputControl!$A$150=TRUE,$Q$51,0)","v":0},{"$f":"IF(InputControl!$A$151=TRUE,$Q$50,0)","v":0},{"$f":"IF(InputControl!$A$152=TRUE,$Q$49,0)","v":0},0,{"$f":"IF(OR(C99>1,D99>1,E99>1,F99>1,G99>1,H99>1,I99>1,J99>1,K99>1,L99>1,M99>1,N99>1,AA99>12),S77,SUM(C72:N72))","v":0},null,"Not Annual Answer",""]
[null,null,{"$f":"IF(InputControl!$A$141=TRUE,$Q$49,0)","v":0},{"$f":"IF(InputControl!$A$142=TRUE,$Q$48,0)","v":0},{"$f":"IF(InputControl!$A$143=TRUE,$Q$47,0)","v":0},{"$f":"IF(InputControl!$A$144=TRUE,$Q$46,0)","v":0},{"$f":"IF(InputControl!$A$145=TRUE,$Q$45,0)","v":0},{"$f":"IF(InputControl!$A$146=TRUE,$Q$56,0)","v":0},{"$f":"IF(InputControl!$A$147=TRUE,$Q$55,0)","v":0},{"$f":"IF(InputControl!$A$148=TRUE,$Q$54,0)","v":0},{"$f":"IF(InputControl!$A$149=TRUE,$Q$53,0)","v":0},{"$f":"IF(InputControl!$A$150=TRUE,$Q$52,0)","v":0},{"$f":"IF(InputControl!$A$151=TRUE,$Q$51,0)","v":0},{"$f":"IF(InputControl!$A$152=TRUE,$Q$50,0)","v":0},0,{"$f":"IF(OR(C99>1,D99>1,E99>1,F99>1,G99>1,H99>1,I99>1,J99>1,K99>1,L99>1,M99>1,N99>1,AA99>12),S77,SUM(C73:N73))","v":0},null,"DATA","ERROR"]
[null,null,{"$f":"IF(InputControl!$A$141=TRUE,$Q$50,0)","v":0},{"$f":"IF(InputControl!$A$142=TRUE,$Q$49,0)","v":0},{"$f":"IF(InputControl!$A$143=TRUE,$Q$48,0)","v":0},{"$f":"IF(InputControl!$A$144=TRUE,$Q$47,0)","v":0},{"$f":"IF(InputControl!$A$145=TRUE,$Q$46,0)","v":0},{"$f":"IF(InputControl!$A$146=TRUE,$Q$45,0)","v":0},{"$f":"IF(InputControl!$A$147=TRUE,$Q$56,0)","v":0},{"$f":"IF(InputControl!$A$148=TRUE,$Q$55,0)","v":0},{"$f":"IF(InputControl!$A$149=TRUE,$Q$54,0)","v":0},{"$f":"IF(InputControl!$A$150=TRUE,$Q$53,0)","v":0},{"$f":"IF(InputControl!$A$151=TRUE,$Q$52,0)","v":0},{"$f":"IF(InputControl!$A$152=TRUE,$Q$51,0)","v":0},0,{"$f":"IF(OR(C99>1,D99>1,E99>1,F99>1,G99>1,H99>1,I99>1,J99>1,K99>1,L99>1,M99>1,N99>1,AA99>12),S77,SUM(C74:N74))","v":0}]
[null,null,{"$f":"IF(InputControl!$A$141=TRUE,$Q$51,0)","v":0},{"$f":"IF(InputControl!$A$142=TRUE,$Q$50,0)","v":0},{"$f":"IF(InputControl!$A$143=TRUE,$Q$49,0)","v":0},{"$f":"IF(InputControl!$A$144=TRUE,$Q$48,0)","v":0},{"$f":"IF(InputControl!$A$145=TRUE,$Q$47,0)","v":0},{"$f":"IF(InputControl!$A$146=TRUE,$Q$46,0)","v":0},{"$f":"IF(InputControl!$A$147=TRUE,$Q$45,0)","v":0},{"$f":"IF(InputControl!$A$148=TRUE,$Q$56,0)","v":0},{"$f":"IF(InputControl!$A$149=TRUE,$Q$55,0)","v":0},{"$f":"IF(InputControl!$A$150=TRUE,$Q$54,0)","v":0},{"$f":"IF(InputControl!$A$151=TRUE,$Q$53,0)","v":0},{"$f":"IF(InputControl!$A$152=TRUE,$Q$52,0)","v":0},0,{"$f":"IF(OR(C99>1,D99>1,E99>1,F99>1,G99>1,H99>1,I99>1,J99>1,K99>1,L99>1,M99>1,N99>1,AA99>12),S77,SUM(C75:N75))","v":0},null," "]
[null,null,{"$f":"IF(InputControl!$A$141=TRUE,$Q$52,0)","v":0},{"$f":"IF(InputControl!$A$142=TRUE,$Q$51,0)","v":0},{"$f":"IF(InputControl!$A$143=TRUE,$Q$50,0)","v":0},{"$f":"IF(InputControl!$A$144=TRUE,$Q$49,0)","v":0},{"$f":"IF(InputControl!$A$145=TRUE,$Q$48,0)","v":0},{"$f":"IF(InputControl!$A$146=TRUE,$Q$47,0)","v":0},{"$f":"IF(InputControl!$A$147=TRUE,$Q$46,0)","v":0},{"$f":"IF(InputControl!$A$148=TRUE,$Q$45,0)","v":0},{"$f":"IF(InputControl!$A$149=TRUE,$Q$56,0)","v":0},{"$f":"IF(InputControl!$A$150=TRUE,$Q$55,0)","v":0},{"$f":"IF(InputControl!$A$151=TRUE,$Q$54,0)","v":0},{"$f":"IF(InputControl!$A$152=TRUE,$Q$53,0)","v":0},0,{"$f":"IF(OR(C99>1,D99>1,E99>1,F99>1,G99>1,H99>1,I99>1,J99>1,K99>1,L99>1,M99>1,N99>1,AA99>12),S77,SUM(C76:N76))","v":0},null," ","",null,null,null,null,null,null,null,null,{"$f":"IF(AND(J174<>0,J174<=20),\"\",AB83)","v":0}]
[null,null,{"$f":"IF(InputControl!$A$141=TRUE,$Q$53,0)","v":0},{"$f":"IF(InputControl!$A$142=TRUE,$Q$52,0)","v":0},{"$f":"IF(InputControl!$A$143=TRUE,$Q$51,0)","v":0},{"$f":"IF(InputControl!$A$144=TRUE,$Q$50,0)","v":0},{"$f":"IF(InputControl!$A$145=TRUE,$Q$49,0)","v":0},{"$f":"IF(InputControl!$A$146=TRUE,$Q$48,0)","v":0},{"$f":"IF(InputControl!$A$147=TRUE,$Q$47,0)","v":0},{"$f":"IF(InputControl!$A$148=TRUE,$Q$46,0)","v":0},{"$f":"IF(InputControl!$A$149=TRUE,$Q$45,0)","v":0},{"$f":"IF(InputControl!$A$150=TRUE,$Q$56,0)","v":0},{"$f":"IF(InputControl!$A$151=TRUE,$Q$55,0)","v":0},{"$f":"IF(InputControl!$A$152=TRUE,$Q$54,0)","v":0},0,{"$f":"IF(OR(C99>1,D99>1,E99>1,F99>1,G99>1,H99>1,I99>1,J99>1,K99>1,L99>1,M99>1,N99>1,AA99>12),S77,SUM(C77:N77))","v":0},null,"DATA",null,null,null,null,null,null,null,null,null,"Old"]
[null,null,{"$f":"IF(InputControl!$A$141=TRUE,$Q$54,0)","v":0},{"$f":"IF(InputControl!$A$142=TRUE,$Q$53,0)","v":0},{"$f":"IF(InputControl!$A$143=TRUE,$Q$52,0)","v":0},{"$f":"IF(InputControl!$A$144=TRUE,$Q$51,0)","v":0},{"$f":"IF(InputControl!$A$145=TRUE,$Q$50,0)","v":0},{"$f":"IF(InputControl!$A$146=TRUE,$Q$49,0)","v":0},{"$f":"IF(InputControl!$A$147=TRUE,$Q$48,0)","v":0},{"$f":"IF(InputControl!$A$148=TRUE,$Q$47,0)","v":0},{"$f":"IF(InputControl!$A$149=TRUE,$Q$46,0)","v":0},{"$f":"IF(InputControl!$A$150=TRUE,$Q$45,0)","v":0},{"$f":"IF(InputControl!$A$151=TRUE,$Q$56,0)","v":0},{"$f":"IF(InputControl!$A$152=TRUE,$Q$55,0)","v":0},0,{"$f":"IF(OR(C99>1,D99>1,E99>1,F99>1,G99>1,H99>1,I99>1,J99>1,K99>1,L99>1,M99>1,N99>1,AA99>12),S77,SUM(C78:N78))","v":0},null,"DATA","2-in10 or 1-in-10 rainfall data not matching with rainfall event"]
[null,null,{"$f":"IF(InputControl!$A$141=TRUE,$Q$55,0)","v":0},{"$f":"IF(InputControl!$A$142=TRUE,$Q$54,0)","v":0},{"$f":"IF(InputControl!$A$143=TRUE,$Q$53,0)","v":0},{"$f":"IF(InputControl!$A$144=TRUE,$Q$52,0)","v":0},{"$f":"IF(InputControl!$A$145=TRUE,$Q$51,0)","v":0},{"$f":"IF(InputControl!$A$146=TRUE,$Q$50,0)","v":0},{"$f":"IF(InputControl!$A$147=TRUE,$Q$49,0)","v":0},{"$f":"IF(InputControl!$A$148=TRUE,$Q$48,0)","v":0},{"$f":"IF(InputControl!$A$149=TRUE,$Q$47,0)","v":0},{"$f":"IF(InputControl!$A$150=TRUE,$Q$46,0)","v":0},{"$f":"IF(InputControl!$A$151=TRUE,$Q$45,0)","v":0},{"$f":"IF(InputControl!$A$152=TRUE,$Q$56,0)","v":0},0,{"$f":"IF(OR(C99>1,D99>1,E99>1,F99>1,G99>1,H99>1,I99>1,J99>1,K99>1,L99>1,M99>1,N99>1,AA99>12),S77,SUM(C79:N79))","v":0},null,"DATA","The selected crops plantings overlap with the selected crop's growing season length"]
[null,null,{"$f":"IF(InputControl!$A$141=TRUE,$Q$56,0)","v":0},{"$f":"IF(InputControl!$A$142=TRUE,$Q$55,0)","v":0},{"$f":"IF(InputControl!$A$143=TRUE,$Q$54,0)","v":0},{"$f":"IF(InputControl!$A$144=TRUE,$Q$53,0)","v":0},{"$f":"IF(InputControl!$A$145=TRUE,$Q$52,0)","v":0},{"$f":"IF(InputControl!$A$146=TRUE,$Q$51,0)","v":0},{"$f":"IF(InputControl!$A$147=TRUE,$Q$50,0)","v":0},{"$f":"IF(InputControl!$A$148=TRUE,$Q$49,0)","v":0},{"$f":"IF(InputControl!$A$149=TRUE,$Q$48,0)","v":0},{"$f":"IF(InputControl!$A$150=TRUE,$Q$47,0)","v":0},{"$f":"IF(InputControl!$A$151=TRUE,$Q$46,0)","v":0},{"$f":"IF(InputControl!$A$152=TRUE,$Q$45,0)","v":0},0,{"$f":"IF(OR(C99>1,D99>1,E99>1,F99>1,G99>1,H99>1,I99>1,J99>1,K99>1,L99>1,M99>1,N99>1,AA99>12),S77,SUM(C80:N80))","v":0},null,"DATA","The total months planted by the crop exceeds one year"]
[null,null,null,null,null,null,null,null,null,null,null,null,null,null,null,null,null,"DATA","The irrigated acreage is 0.00"]
[null,"Total",{"$f":"SUM(C69:C80)","v":0},{"$f":"SUM(D69:D80)","v":0},0,0,0,0,0,0,0,0,0,0,null,null,null,"DATA","No rainfall station data"]
[null,null,null,null,null,null,null,null,null,null,null,null,null,null,null,null,null,"DATA","Either no parcel data or total parcels exceed 20"]
[null,null,null,null,null,null,null,null,null,null,null,null,null,null,null,null,null,"DATA","CALCULATION GOOD"]
[null,null,"Jan","Feb","Mar","Apr","May","Jun","Jul","Aug","Sep","Oct","Nov","Dec","Jan","Feb","Mar","Apr","May","Jun","Jul","Aug","Sep","Oct","Nov",null,"Totals"]
[null,"Jan",{"$f":"IF(AND(InputControl!$A$141=TRUE,InputControl!$C$113-1>=1),1,0)","v":0},{"$f":"IF(AND(InputControl!$A$141=TRUE,InputControl!$C$113-2>=1),1,0)","v":0},{"$f":"IF(AND(InputControl!$A$141=TRUE,InputControl!$C$113-3>=1),1,0)","v":0},{"$f":"IF(AND(InputControl!$A$141=TRUE,InputControl!$C$113-4>=1),1,0)","v":0},{"$f":"IF(AND(InputControl!$A$141=TRUE,InputControl!$C$113-5>=1),1,0)","v":0},{"$f":"IF(AND(InputControl!$A$141=TRUE,InputControl!$C$113-6>=1),1,0)","v":0},{"$f":"IF(AND(InputControl!$A$141=TRUE,InputControl!$C$113-7>=1),1,0)","v":0},{"$f":"IF(AND(InputControl!$A$141=TRUE,InputControl!$C$113-8>=1),1,0)","v":0},{"$f":"IF(AND(InputControl!$A$141=TRUE,InputControl!$C$113-9>=1),1,0)","v":0},{"$f":"IF(AND(InputControl!$A$141=TRUE,InputControl!$C$113-10>=1),1,0)","v":0},{"$f":"IF(AND(InputControl!$A$141=TRUE,InputControl!$C$113-11>=1),1,0)","v":0},{"$f":"IF(AND(InputControl!$A$141=TRUE,InputControl!$C$113-12>=1),1,0)","v":0},{"$f":"IF(AND(InputControl!$A$141=TRUE,InputControl!$C$113-13>=1),1,0)","v":0},{"$f":"IF(AND(InputControl!$A$141=TRUE,InputControl!$C$113-14>=1),1,0)","v":0},{"$f":"IF(AND(InputControl!$A$141=TRUE,InputControl!$C$113-15>=1),1,0)","v":0},{"$f":"IF(AND(InputControl!$A$141=TRUE,InputControl!$C$113-16>=1),1,0)","v":0},{"$f":"IF(AND(InputControl!$A$141=TRUE,InputControl!$C$113-17>=1),1,0)","v":0},{"$f":"IF(AND(InputControl!$A$141=TRUE,InputControl!$C$113-18>=1),1,0)","v":0},{"$f":"IF(AND(InputControl!$A$141=TRUE,InputControl!$C$113-19>=1),1,0)","v":0},{"$f":"IF(AND(InputControl!$A$141=TRUE,InputControl!$C$113-20>=1),1,0)","v":0},{"$f":"IF(AND(InputControl!$A$141=TRUE,InputControl!$C$113-21>=1),1,0)","v":0},{"$f":"IF(AND(InputControl!$A$141=TRUE,InputControl!$C$113-22>=1),1,0)","v":0},{"$f":"IF(AND(InputControl!$A$141=TRUE,InputControl!$C$113-23>=1),1,0)","v":0},null,{"$f":"SUM(C86:Y86)","v":0}]
[null,"Feb",0,{"$f":"IF(AND(InputControl!$A$142=TRUE,InputControl!$C$113-1>=1),1,0)","v":0},{"$f":"IF(AND(InputControl!$A$142=TRUE,InputControl!$C$113-2>=1),1,0)","v":0},{"$f":"IF(AND(InputControl!$A$142=TRUE,InputControl!$C$113-3>=1),1,0)","v":0},{"$f":"IF(AND(InputControl!$A$142=TRUE,InputControl!$C$113-4>=1),1,0)","v":0},{"$f":"IF(AND(InputControl!$A$142=TRUE,InputControl!$C$113-5>=1),1,0)","v":0},{"$f":"IF(AND(InputControl!$A$142=TRUE,InputControl!$C$113-6>=1),1,0)","v":0},{"$f":"IF(AND(InputControl!$A$142=TRUE,InputControl!$C$113-7>=1),1,0)","v":0},{"$f":"IF(AND(InputControl!$A$142=TRUE,InputControl!$C$113-8>=1),1,0)","v":0},{"$f":"IF(AND(InputControl!$A$142=TRUE,InputControl!$C$113-9>=1),1,0)","v":0},{"$f":"IF(AND(InputControl!$A$142=TRUE,InputControl!$C$113-10>=1),1,0)","v":0},{"$f":"IF(AND(InputControl!$A$142=TRUE,InputControl!$C$113-11>=1),1,0)","v":0},{"$f":"IF(AND(InputControl!$A$142=TRUE,InputControl!$C$113-12>=1),1,0)","v":0},{"$f":"IF(AND(InputControl!$A$142=TRUE,InputControl!$C$113-13>=1),1,0)","v":0},{"$f":"IF(AND(InputControl!$A$142=TRUE,InputControl!$C$113-14>=1),1,0)","v":0},{"$f":"IF(AND(InputControl!$A$142=TRUE,InputControl!$C$113-15>=1),1,0)","v":0},{"$f":"IF(AND(InputControl!$A$142=TRUE,InputControl!$C$113-16>=1),1,0)","v":0},{"$f":"IF(AND(InputControl!$A$142=TRUE,InputControl!$C$113-17>=1),1,0)","v":0},{"$f":"IF(AND(InputControl!$A$142=TRUE,InputControl!$C$113-18>=1),1,0)","v":0},{"$f":"IF(AND(InputControl!$A$142=TRUE,InputControl!$C$113-19>=1),1,0)","v":0},{"$f":"IF(AND(InputControl!$A$142=TRUE,InputControl!$C$113-20>=1),1,0)","v":0},{"$f":"IF(AND(InputControl!$A$142=TRUE,InputControl!$C$113-21>=1),1,0)","v":0},{"$f":"IF(AND(InputControl!$A$142=TRUE,InputControl!$C$113-22>=1),1,0)","v":0},null,{"$f":"SUM(C87:Y87)","v":0}]
[null,"Mar",0,0,{"$f":"IF(AND(InputControl!$A$143=TRUE,InputControl!$C$113-1>=1),1,0)","v":0},{"$f":"IF(AND(InputControl!$A$143=TRUE,InputControl!$C$113-2>=1),1,0)","v":0},{"$f":"IF(AND(InputControl!$A$143=TRUE,InputControl!$C$113-3>=1),1,0)","v":0},{"$f":"IF(AND(InputControl!$A$143=TRUE,InputControl!$C$113-4>=1),1,0)","v":0},{"$f":"IF(AND(InputControl!$A$143=TRUE,InputControl!$C$113-5>=1),1,0)","v":0},{"$f":"IF(AND(InputControl!$A$143=TRUE,InputControl!$C$113-6>=1),1,0)","v":0},{"$f":"IF(AND(InputControl!$A$143=TRUE,InputControl!$C$113-7>=1),1,0)","v":0},{"$f":"IF(AND(InputControl!$A$143=TRUE,InputControl!$C$113-8>=1),1,0)","v":0},{"$f":"IF(AND(InputControl!$A$143=TRUE,InputControl!$C$113-9>=1),1,0)","v":0},{"$f":"IF(AND(InputControl!$A$143=TRUE,InputControl!$C$113-10>=1),1,0)","v":0},{"$f":"IF(AND(InputControl!$A$143=TRUE,InputControl!$C$113-11>=1),1,0)","v":0},{"$f":"IF(AND(InputControl!$A$143=TRUE,InputControl!$C$113-12>=1),1,0)","v":0},{"$f":"IF(AND(InputControl!$A$143=TRUE,InputControl!$C$113-13>=1),1,0)","v":0},{"$f":"IF(AND(InputControl!$A$143=TRUE,InputControl!$C$113-14>=1),1,0)","v":0},{"$f":"IF(AND(InputControl!$A$143=TRUE,InputControl!$C$113-15>=1),1,0)","v":0},{"$f":"IF(AND(InputControl!$A$143=TRUE,InputControl!$C$113-16>=1),1,0)","v":0},{"$f":"IF(AND(InputControl!$A$143=TRUE,InputControl!$C$113-17>=1),1,0)","v":0},{"$f":"IF(AND(InputControl!$A$143=TRUE,InputControl!$C$113-18>=1),1,0)","v":0},{"$f":"IF(AND(InputControl!$A$143=TRUE,InputControl!$C$113-19>=1),1,0)","v":0},{"$f":"IF(AND(InputControl!$A$143=TRUE,InputControl!$C$113-20>=1),1,0)","v":0},{"$f":"IF(AND(InputControl!$A$143=TRUE,InputControl!$C$113-21>=1),1,0)","v":0},null,0]
[null,"Apr",0,0,0,{"$f":"IF(AND(InputControl!$A$144=TRUE,InputControl!$C$113-1>=1),1,0)","v":1},{"$f":"IF(AND(InputControl!$A$144=TRUE,InputControl!$C$113-2>=1),1,0)","v":1},{"$f":"IF(AND(InputControl!$A$144=TRUE,InputControl!$C$113-3>=1),1,0)","v":1},{"$f":"IF(AND(InputControl!$A$144=TRUE,InputControl!$C$113-4>=1),1,0)","v":1},{"$f":"IF(AND(InputControl!$A$144=TRUE,InputControl!$C$113-5>=1),1,0)","v":0},{"$f":"IF(AND(InputControl!$A$144=TRUE,InputControl!$C$113-6>=1),1,0)","v":0},{"$f":"IF(AND(InputControl!$A$144=TRUE,InputControl!$C$113-7>=1),1,0)","v":0},{"$f":"IF(AND(InputControl!$A$144=TRUE,InputControl!$C$113-8>=1),1,0)","v":0},{"$f":"IF(AND(InputControl!$A$144=TRUE,InputControl!$C$113-9>=1),1,0)","v":0},{"$f":"IF(AND(InputControl!$A$144=TRUE,InputControl!$C$113-10>=1),1,0)","v":0},{"$f":"IF(AND(InputControl!$A$144=TRUE,InputControl!$C$113-11>=1),1,0)","v":0},{"$f":"IF(AND(InputControl!$A$144=TRUE,InputControl!$C$113-12>=1),1,0)","v":0},{"$f":"IF(AND(InputControl!$A$144=TRUE,InputControl!$C$113-13>=1),1,0)","v":0},{"$f":"IF(AND(InputControl!$A$144=TRUE,InputControl!$C$113-14>=1),1,0)","v":0},{"$f":"IF(AND(InputControl!$A$144=TRUE,InputControl!$C$113-15>=1),1,0)","v":0},{"$f":"IF(AND(InputControl!$A$144=TRUE,InputControl!$C$113-16>=1),1,0)","v":0},{"$f":"IF(AND(InputControl!$A$144=TRUE,InputControl!$C$113-17>=1),1,0)","v":0},{"$f":"IF(AND(InputControl!$A$144=TRUE,InputControl!$C$113-18>=1),1,0)","v":0},{"$f":"IF(AND(InputControl!$A$144=TRUE,InputControl!$C$113-19>=1),1,0)","v":0},{"$f":"IF(AND(InputControl!$A$144=TRUE,InputControl!$C$113-20>=1),1,0)","v":0},null,4]
[null,"May",0,0,0,0,{"$f":"IF(AND(InputControl!$A$145=TRUE,InputControl!$C$113-1>=1),1,0)","v":0},{"$f":"IF(AND(InputControl!$A$145=TRUE,InputControl!$C$113-2>=1),1,0)","v":0},{"$f":"IF(AND(InputControl!$A$145=TRUE,InputControl!$C$113-3>=1),1,0)","v":0},{"$f":"IF(AND(InputControl!$A$145=TRUE,InputControl!$C$113-4>=1),1,0)","v":0},{"$f":"IF(AND(InputControl!$A$145=TRUE,InputControl!$C$113-5>=1),1,0)","v":0},{"$f":"IF(AND(InputControl!$A$145=TRUE,InputControl!$C$113-6>=1),1,0)","v":0},{"$f":"IF(AND(InputControl!$A$145=TRUE,InputControl!$C$113-7>=1),1,0)","v":0},{"$f":"IF(AND(InputControl!$A$145=TRUE,InputControl!$C$113-8>=1),1,0)","v":0},{"$f":"IF(AND(InputControl!$A$145=TRUE,InputControl!$C$113-9>=1),1,0)","v":0},{"$f":"IF(AND(InputControl!$A$145=TRUE,InputControl!$C$113-10>=1),1,0)","v":0},{"$f":"IF(AND(InputControl!$A$145=TRUE,InputControl!$C$113-11>=1),1,0)","v":0},{"$f":"IF(AND(InputControl!$A$145=TRUE,InputControl!$C$113-12>=1),1,0)","v":0},{"$f":"IF(AND(InputControl!$A$145=TRUE,InputControl!$C$113-13>=1),1,0)","v":0},{"$f":"IF(AND(InputControl!$A$145=TRUE,InputControl!$C$113-14>=1),1,0)","v":0},{"$f":"IF(AND(InputControl!$A$145=TRUE,InputControl!$C$113-15>=1),1,0)","v":0},{"$f":"IF(AND(InputControl!$A$145=TRUE,InputControl!$C$113-16>=1),1,0)","v":0},{"$f":"IF(AND(InputControl!$A$145=TRUE,InputControl!$C$113-17>=1),1,0)","v":0},{"$f":"IF(AND(InputControl!$A$145=TRUE,InputControl!$C$113-18>=1),1,0)","v":0},{"$f":"IF(AND(InputControl!$A$145=TRUE,InputControl!$C$113-19>=1),1,0)","v":0},null,0]
[null,"Jun",0,0,0,0,0,{"$f":"IF(AND(InputControl!$A$146=TRUE,InputControl!$C$113-1>=1),1,0)","v":0},{"$f":"IF(AND(InputControl!$A$146=TRUE,InputControl!$C$113-2>=1),1,0)","v":0},{"$f":"IF(AND(InputControl!$A$146=TRUE,InputControl!$C$113-3>=1),1,0)","v":0},{"$f":"IF(AND(InputControl!$A$146=TRUE,InputControl!$C$113-4>=1),1,0)","v":0},{"$f":"IF(AND(InputControl!$A$146=TRUE,InputControl!$C$113-5>=1),1,0)","v":0},{"$f":"IF(AND(InputControl!$A$146=TRUE,InputControl!$C$113-6>=1),1,0)","v":0},{"$f":"IF(AND(InputControl!$A$146=TRUE,InputControl!$C$113-7>=1),1,0)","v":0},{"$f":"IF(AND(InputControl!$A$146=TRUE,InputControl!$C$113-8>=1),1,0)","v":0},{"$f":"IF(AND(InputControl!$A$146=TRUE,InputControl!$C$113-9>=1),1,0)","v":0},{"$f":"IF(AND(InputControl!$A$146=TRUE,InputControl!$C$113-10>=1),1,0)","v":0},{"$f":"IF(AND(InputControl!$A$146=TRUE,InputControl!$C$113-11>=1),1,0)","v":0},{"$f":"IF(AND(InputControl!$A$146=TRUE,InputControl!$C$113-12>=1),1,0)","v":0},{"$f":"IF(AND(InputControl!$A$146=TRUE,InputControl!$C$113-13>=1),1,0)","v":0},{"$f":"IF(AND(InputControl!$A$146=TRUE,InputControl!$C$113-14>=1),1,0)","v":0},{"$f":"IF(AND(InputControl!$A$146=TRUE,InputControl!$C$113-15>=1),1,0)","v":0},{"$f":"IF(AND(InputControl!$A$146=TRUE,InputControl!$C$113-16>=1),1,0)","v":0},{"$f":"IF(AND(InputControl!$A$146=TRUE,InputControl!$C$113-17>=1),1,0)","v":0},{"$f":"IF(AND(InputControl!$A$146=TRUE,InputControl!$C$113-18>=1),1,0)","v":0},null,0]
[null,"Jul",0,0,0,0,0,0,{"$f":"IF(AND(InputControl!$A$147=TRUE,InputControl!$C$113-1>=1),1,0)","v":0},{"$f":"IF(AND(InputControl!$A$147=TRUE,InputControl!$C$113-2>=1),1,0)","v":0},{"$f":"IF(AND(InputControl!$A$147=TRUE,InputControl!$C$113-3>=1),1,0)","v":0},{"$f":"IF(AND(InputControl!$A$147=TRUE,InputControl!$C$113-4>=1),1,0)","v":0},{"$f":"IF(AND(InputControl!$A$147=TRUE,InputControl!$C$113-5>=1),1,0)","v":0},{"$f":"IF(AND(InputControl!$A$147=TRUE,InputControl!$C$113-6>=1),1,0)","v":0},{"$f":"IF(AND(InputControl!$A$147=TRUE,InputControl!$C$113-7>=1),1,0)","v":0},{"$f":"IF(AND(InputControl!$A$147=TRUE,InputControl!$C$113-8>=1),1,0)","v":0},{"$f":"IF(AND(InputControl!$A$147=TRUE,InputControl!$C$113-9>=1),1,0)","v":0},{"$f":"IF(AND(InputControl!$A$147=TRUE,InputControl!$C$113-10>=1),1,0)","v":0},{"$f":"IF(AND(InputControl!$A$147=TRUE,InputControl!$C$113-11>=1),1,0)","v":0},{"$f":"IF(AND(InputControl!$A$147=TRUE,InputControl!$C$113-12>=1),1,0)","v":0},{"$f":"IF(AND(InputControl!$A$147=TRUE,InputControl!$C$113-13>=1),1,0)","v":0},{"$f":"IF(AND(InputControl!$A$147=TRUE,InputControl!$C$113-14>=1),1,0)","v":0},{"$f":"IF(AND(InputControl!$A$147=TRUE,InputControl!$C$113-15>=1),1,0)","v":0},{"$f":"IF(AND(InputControl!$A$147=TRUE,InputControl!$C$113-16>=1),1,0)","v":0},{"$f":"IF(AND(InputControl!$A$147=TRUE,InputControl!$C$113-17>=1),1,0)","v":0},null,0]
[null,"Aug",0,0,0,0,0,0,0,{"$f":"IF(AND(InputControl!$A$148=TRUE,InputControl!$C$113-1>=1),1,0)","v":1},{"$f":"IF(AND(InputControl!$A$148=TRUE,InputControl!$C$113-2>=1),1,0)","v":1},{"$f":"IF(AND(InputControl!$A$148=TRUE,InputControl!$C$113-3>=1),1,0)","v":1},{"$f":"IF(AND(InputControl!$A$148=TRUE,InputControl!$C$113-4>=1),1,0)","v":1},{"$f":"IF(AND(InputControl!$A$148=TRUE,InputControl!$C$113-5>=1),1,0)","v":0},{"$f":"IF(AND(InputControl!$A$148=TRUE,InputControl!$C$113-6>=1),1,0)","v":0},{"$f":"IF(AND(InputControl!$A$148=TRUE,InputControl!$C$113-7>=1),1,0)","v":0},{"$f":"IF(AND(InputControl!$A$148=TRUE,InputControl!$C$113-8>=1),1,0)","v":0},{"$f":"IF(AND(InputControl!$A$148=TRUE,InputControl!$C$113-9>=1),1,0)","v":0},{"$f":"IF(AND(InputControl!$A$148=TRUE,InputControl!$C$113-10>=1),1,0)","v":0},{"$f":"IF(AND(InputControl!$A$148=TRUE,InputControl!$C$113-11>=1),1,0)","v":0},{"$f":"IF(AND(InputControl!$A$148=TRUE,InputControl!$C$113-12>=1),1,0)","v":0},{"$f":"IF(AND(InputControl!$A$148=TRUE,InputControl!$C$113-13>=1),1,0)","v":0},{"$f":"IF(AND(InputControl!$A$148=TRUE,InputControl!$C$113-14>=1),1,0)","v":0},{"$f":"IF(AND(InputControl!$A$148=TRUE,InputControl!$C$113-15>=1),1,0)","v":0},{"$f":"IF(AND(InputControl!$A$148=TRUE,InputControl!$C$113-16>=1),1,0)","v":0},null,4]
[null,"Sep",0,0,0,0,0,0,0,0,{"$f":"IF(AND(InputControl!$A$149=TRUE,InputControl!$C$113-1>=1),1,0)","v":0},{"$f":"IF(AND(InputControl!$A$149=TRUE,InputControl!$C$113-2>=1),1,0)","v":0},{"$f":"IF(AND(InputControl!$A$149=TRUE,InputControl!$C$113-3>=1),1,0)","v":0},{"$f":"IF(AND(InputControl!$A$149=TRUE,InputControl!$C$113-4>=1),1,0)","v":0},{"$f":"IF(AND(InputControl!$A$149=TRUE,InputControl!$C$113-5>=1),1,0)","v":0},{"$f":"IF(AND(InputControl!$A$149=TRUE,InputControl!$C$113-6>=1),1,0)","v":0},{"$f":"IF(AND(InputControl!$A$149=TRUE,InputControl!$C$113-7>=1),1,0)","v":0},{"$f":"IF(AND(InputControl!$A$149=TRUE,InputControl!$C$113-8>=1),1,0)","v":0},{"$f":"IF(AND(InputControl!$A$149=TRUE,InputControl!$C$113-9>=1),1,0)","v":0},{"$f":"IF(AND(InputControl!$A$149=TRUE,InputControl!$C$113-10>=1),1,0)","v":0},{"$f":"IF(AND(InputControl!$A$149=TRUE,InputControl!$C$113-11>=1),1,0)","v":0},{"$f":"IF(AND(InputControl!$A$149=TRUE,InputControl!$C$113-12>=1),1,0)","v":0},{"$f":"IF(AND(InputControl!$A$149=TRUE,InputControl!$C$113-13>=1),1,0)","v":0},{"$f":"IF(AND(InputControl!$A$149=TRUE,InputControl!$C$113-14>=1),1,0)","v":0},{"$f":"IF(AND(InputControl!$A$149=TRUE,InputControl!$C$113-15>=1),1,0)","v":0},null,0]
[null,"Oct",0,0,0,0,0,0,0,0,0,{"$f":"IF(AND(InputControl!$A$150=TRUE,InputControl!$C$113-1>=1),1,0)","v":1},{"$f":"IF(AND(InputControl!$A$150=TRUE,InputControl!$C$113-2>=1),1,0)","v":1},{"$f":"IF(AND(InputControl!$A$150=TRUE,InputControl!$C$113-3>=1),1,0)","v":1},{"$f":"IF(AND(InputControl!$A$150=TRUE,InputControl!$C$113-4>=1),1,0)","v":1},{"$f":"IF(AND(InputControl!$A$150=TRUE,InputControl!$C$113-5>=1),1,0)","v":0},{"$f":"IF(AND(InputControl!$A$150=TRUE,InputControl!$C$113-6>=1),1,0)","v":0},{"$f":"IF(AND(InputControl!$A$150=TRUE,InputControl!$C$113-7>=1),1,0)","v":0},{"$f":"IF(AND(InputControl!$A$150=TRUE,InputControl!$C$113-8>=1),1,0)","v":0},{"$f":"IF(AND(InputControl!$A$150=TRUE,InputControl!$C$113-9>=1),1,0)","v":0},{"$f":"IF(AND(InputControl!$A$150=TRUE,InputControl!$C$113-10>=1),1,0)","v":0},{"$f":"IF(AND(InputControl!$A$150=TRUE,InputControl!$C$113-11>=1),1,0)","v":0},{"$f":"IF(AND(InputControl!$A$150=TRUE,InputControl!$C$113-12>=1),1,0)","v":0},{"$f":"IF(AND(InputControl!$A$150=TRUE,InputControl!$C$113-13>=1),1,0)","v":0},{"$f":"IF(AND(InputControl!$A$150=TRUE,InputControl!$C$113-14>=1),1,0)","v":0},null,4]
[null,"Nov",0,0,0,0,0,0,0,0,0,0,{"$f":"IF(AND(InputControl!$A$151=TRUE,InputControl!$C$113-1>=1),1,0)","v":0},{"$f":"IF(AND(InputControl!$A$151=TRUE,InputControl!$C$113-2>=1),1,0)","v":0},{"$f":"IF(AND(InputControl!$A$151=TRUE,InputControl!$C$113-3>=1),1,0)","v":0},{"$f":"IF(AND(InputControl!$A$151=TRUE,InputControl!$C$113-4>=1),1,0)","v":0},{"$f":"IF(AND(InputControl!$A$151=TRUE,InputControl!$C$113-5>=1),1,0)","v":0},{"$f":"IF(AND(InputControl!$A$151=TRUE,InputControl!$C$113-6>=1),1,0)","v":0},{"$f":"IF(AND(InputControl!$A$151=TRUE,InputControl!$C$113-7>=1),1,0)","v":0},{"$f":"IF(AND(InputControl!$A$151=TRUE,InputControl!$C$113-8>=1),1,0)","v":0},{"$f":"IF(AND(InputControl!$A$151=TRUE,InputControl!$C$113-9>=1),1,0)","v":0},{"$f":"IF(AND(InputControl!$A$151=TRUE,InputControl!$C$113-10>=1),1,0)","v":0},{"$f":"IF(AND(InputControl!$A$151=TRUE,InputControl!$C$113-11>=1),1,0)","v":0},{"$f":"IF(AND(InputControl!$A$151=TRUE,InputControl!$C$113-12>=1),1,0)","v":0},{"$f":"IF(AND(InputControl!$A$151=TRUE,InputControl!$C$113-13>=1),1,0)","v":0},null,0]
[null,"Dec",0,0,0,0,0,0,0,0,0,0,0,{"$f":"IF(AND(InputControl!$A$152=TRUE,InputControl!$C$113-1>=1),1,0)","v":0},{"$f":"IF(AND(InputControl!$A$152=TRUE,InputControl!$C$113-2>=1),1,0)","v":0},{"$f":"IF(AND(InputControl!$A$152=TRUE,InputControl!$C$113-3>=1),1,0)","v":0},{"$f":"IF(AND(InputControl!$A$152=TRUE,InputControl!$C$113-4>=1),1,0)","v":0},{"$f":"IF(AND(InputControl!$A$152=TRUE,InputControl!$C$113-5>=1),1,0)","v":0},{"$f":"IF(AND(InputControl!$A$152=TRUE,InputControl!$C$113-6>=1),1,0)","v":0},{"$f":"IF(AND(InputControl!$A$152=TRUE,InputControl!$C$113-7>=1),1,0)","v":0},{"$f":"IF(AND(InputControl!$A$152=TRUE,InputControl!$C$113-8>=1),1,0)","v":0},{"$f":"IF(AND(InputControl!$A$152=TRUE,InputControl!$C$113-9>=1),1,0)","v":0},{"$f":"IF(AND(InputControl!$A$152=TRUE,InputControl!$C$113-10>=1),1,0)","v":0},{"$f":"IF(AND(InputControl!$A$152=TRUE,InputControl!$C$113-11>=1),1,0)","v":0},{"$f":"IF(AND(InputControl!$A$152=TRUE,InputControl!$C$113-12>=1),1,0)","v":0},null,0]
[]
[null,"Total",{"$f":"SUM(C86:C97)+SUM(O86:O97)","v":1},{"$f":"SUM(D86:D97)+SUM(P86:P97)","v":0},0,1,1,1,1,1,1,2,2,{"$f":"SUM(N86:N97)","v":1}," ","  "," "," ","  "," "," "," "," "," "," ",null,{"$f":"SUM(AA86:AA97)","v":12}]
[]
[]
["Converting Crop Code Numbers to Column Numbers"]
[]
[5,1," ",{"$f":"VLOOKUP(InputControl!$B$57,$A$104:$B$140,2,FALSE)+1","v":2}]
[10,2]
[11,3]
[12,4]
[13,5]
[14,6]
[15,7]
[16,0]
[17,0]
[18,8]
[19,0]
[20,9]
[21,10]
[22,11]
[23,12]
[24,13]
[25,14]
[51,1]
[52,2]
[53,3]
[54,4]
[55,5]
[56,6]
[57,7]
[58,8]
[59,9]
[60,10]
[61,11]
[62,12]
[64,13]
[65,14]
[66,15]
[69,16]
[67,0]
[68,0]
[69,0]
[70,0]
[]
[]
["Adding Crop Plantings"]
[null,null,null,{"$f":"SUM(B145:B156)","v":3},{"$f":"IF(D144=1,\"Planting\",\"Plantings\")","v":"Plantings"},null,{"$f":"CONCATENATE(\"Growing season length of annual crop type = \",InputControl!A113)","v":"Growing season length of annual crop type = 4 months"}]
[{"$f":"IF(InputControl!$A$141=TRUE,InputControl!$B$141,0)","v":0},{"$f":"IF(InputControl!$A$141=TRUE,1,0)","v":0},null,null,null,null,{"$f":"CONCATENATE(D144,\" \",E144)","v":"3 Plantings"}]
[{"$f":"IF(InputControl!$A$142=TRUE,InputControl!$B$142,0)","v":0},{"$f":"IF(InputControl!$A$142=TRUE,1,0)","v":0},null,null,null,null,{"$f":"CONCATENATE(\"Initial \", IF(D144>1,\"plantings\",\"planting\"), \" occurs in : \")","v":"Initial plantings occurs in : "}]
[{"$f":"IF(InputControl!$A$143=TRUE,InputControl!$B$143,0)","v":0},{"$f":"IF(InputControl!$A$143=TRUE,1,0)","v":0},null,null,null,null,{"$f":"CONCATENATE(IF(A144<>0,CONCATENATE(A144,\"   \"),\"\"),IF(A145<>0,CONCATENATE(A145,\"   \"),\"\"),IF(A146<>0,CONCATENATE(A146,\"   \"),\"\"),IF(A147<>0,CONCATENATE(A147,\"   \"),\"\"),IF(A148<>0,CONCATENATE(A148,\"   \"),\"\"),IF(A149<>0,CONCATENATE(A149,\"   \"),\"\"),IF(A150<>0,CONCATENATE(A150,\"   \"),\"\"),IF(A151<>0,CONCATENATE(A151,\"   \"),\"\"),IF(A152<>0,CONCATENATE(A152,\"   \"),\"\"),IF(A153<>0,CONCATENATE(A153,\"   \"),\"\"),IF(A154<>0,CONCATENATE(A154,\"   \"),\"\"),IF(A155<>0,CONCATENATE(A155,\"   \"),\"\"),IF(A156<>0,CONCATENATE(A156,\"\"),\"\"))","v":"April   August   October   "}]
[{"$f":"IF(InputControl!$A$144=TRUE,InputControl!$B$144,0)","v":"April"},{"$f":"IF(InputControl!$A$144=TRUE,1,0)","v":1},null,null,null,null,{"$f":"CONCATENATE(\"Total months planted: \",AA99)","v":"Total months planted: 12"}]
[{"$f":"IF(InputControl!$A$145=TRUE,InputControl!$B$145,0)","v":0},{"$f":"IF(InputControl!$A$145=TRUE,1,0)","v":0}]
[{"$f":"IF(InputControl!$A$146=TRUE,InputControl!$B$146,0)","v":0},{"$f":"IF(InputControl!$A$146=TRUE,1,0)","v":0}]
[{"$f":"IF(InputControl!$A$147=TRUE,InputControl!$B$147,0)","v":0},{"$f":"IF(InputControl!$A$147=TRUE,1,0)","v":0}]
[{"$f":"IF(InputControl!$A$148=TRUE,InputControl!$B$148,0)","v":"August"},{"$f":"IF(InputControl!$A$148=TRUE,1,0)","v":1}]
[{"$f":"IF(InputControl!$A$149=TRUE,InputControl!$B$149,0)","v":0},{"$f":"IF(InputControl!$A$149=TRUE,1,0)","v":0}]
[{"$f":"IF(InputControl!$A$150=TRUE,InputControl!$B$150,0)","v":"October"},{"$f":"IF(InputControl!$A$150=TRUE,1,0)","v":1}]
[{"$f":"IF(InputControl!$A$151=TRUE,InputControl!$B$151,0)","v":0},{"$f":"IF(InputControl!$A$151=TRUE,1,0)","v":0}]
[{"$f":"IF(InputControl!$A$152=TRUE,InputControl!$B$152,0)","v":0},{"$f":"IF(InputControl!$A$152=TRUE,1,0)","v":0}]
[]
["Irrigated Acreage"]
[null,null,null,{"$f":"IF(A160 = 0,0,A160)","v":1}]
[{"$f":"Input2!C13","v":1}]
[]
[]
["Average Day"]
[null,null," "]
[{"$f":"SUM('Blaney Calc'!K19)","v":3234.42},null,{"$f":"IF(A165>100000, C167,IF(A165=100000,C168,IF(A165<10000,C170,C169)))","v":"1-in-10 Annual Average Day < 10,000 Gallons"}]
[null,null," "]
[null,null,"1-in-10 Annual Average Day is > 100,000 Gallons"]
[null,null,"1-in-10 Annual Average Day is = 100,000 Gallons"]
[null,null,"1-in-10 Annual Average Day < 100,000 Gallons"]
[null,null,"1-in-10 Annual Average Day < 10,000 Gallons"]
[]
["Multiple Crops in Parcel"]
[]
[{"$f":"Input2!P4","v":1}]
[{"$f":"C99","v":1},{"$f":"D99","v":0},0,1,1,1,1,1,1,2,2,1,"Crop 5"]
[null,null,null,null,null,null,null,null,null,null,null,null,"Crop 4"]
[null,null,null,null,null,null,null,null,null,null,null,null,"Crop 3"]
[null,null,null,null,null,null,null,null,null,null,null,null,"Crop 2"]
[null,null,null,null,null,null,null,null,null,null,null,null,"Crop 1"]
[{"$f":"SUM(A175:A179)","v":1},0,0,1,1,1,1,1,1,2,2,1]
["Jan","Feb","Mar","Apr","May","Jun","Jul","Aug","Sep","Oct","Nov","Dec"]
[{"$f":"IF('crop k''s'!A180>1,\"JAN\",\"\")","v":""},{"$f":"IF('crop k''s'!B180>1,\"FEB\",\"\")","v":""},{"$f":"IF( 'crop k''s'!C180>1,\"MAR\",\"\")","v":""},{"$f":"IF( 'crop k''s'!D180>1,\"APR\",\"\")","v":""},{"$f":"IF( 'crop k''s'!E180>1,\"MAY\",\"\")","v":""},{"$f":"IF('crop k''s'!F180>1,\"JUN\",\"\")","v":""},{"$f":"IF('crop k''s'!G180>1,\"JUL\",\"\")","v":""},{"$f":"IF( 'crop k''s'!H180>1,\"AUG\",\"\")","v":""},{"$f":"IF( 'crop k''s'!I180>1,\"SEP\",\"\")","v":""},{"$f":"IF( 'crop k''s'!J180>1,\"OCT\",\"\")","v":"OCT"},{"$f":"IF( 'crop k''s'!K180>1,\"NOV\",\"\")","v":"NOV"},{"$f":"IF( 'crop k''s'!L180>1,\"DEC\",\"\")","v":""}]
[0,"OVERLAP",null,{"$f":"IF(AND(A180=0,B180=0,C180=0,D180=0,E180=0,F180=0,G180=0,H180=0,I180=0,J180=0,K180=0,L180=0),\"YES\",0)","v":0},"NO MONTHS SELECTED"]
["ERROR"]
[{"$f":"CONCATENATE(IF(A182<>0,CONCATENATE(A182,\"   \"),\"\"),IF(B182<>0,CONCATENATE(B182,\"   \"),\"\"),IF(C182<>0,CONCATENATE(C182,\"   \"),\"\"),IF(D182<>0,CONCATENATE(D182,\"   \"),\"\"),IF(E182<>0,CONCATENATE(E182,\"   \"),\"\"),IF(F182<>0,CONCATENATE(F182,\"   \"),\"\"),IF(G182<>0,CONCATENATE(G182,\"   \"),\"\"),IF(H182<>0,CONCATENATE(H182,\"   \"),\"\"),IF(I182<>0,CONCATENATE(I182,\"   \"),\"\"),IF(J182<>0,CONCATENATE(J182,\"   \"),\"\"),IF(K182<>0,CONCATENATE(K182,\"   \"),\"\"),IF(L182<>0,CONCATENATE(L182,\"   \"),\"\"),\"\")","v":"                           OCT   NOV      "}]
[]
[{"$f":"SUM(A176:A179)","v":0},{"$f":"SUM(B176:B179)","v":0},0,0,0,0,0,0,0,0,0,0,null,"Months planted"]
[{"$f":"IF('crop k''s'!A187=1,\"JAN\",\"\")","v":""},{"$f":"IF('crop k''s'!B187=1,\"FEB\",\"\")","v":""},{"$f":"IF('crop k''s'!C187=1,\"MAR\",\"\")","v":""},{"$f":"IF('crop k''s'!D187=1,\"APR\",\"\")","v":""},{"$f":"IF('crop k''s'!E187=1,\"MAY\",\"\")","v":""},{"$f":"IF('crop k''s'!F187=1,\"JUN\",\"\")","v":""},{"$f":"IF('crop k''s'!G187=1,\"JUL\",\"\")","v":""},{"$f":"IF('crop k''s'!H187=1,\"AUG\",\"\")","v":""},{"$f":"IF('crop k''s'!I187=1,\"SEP\",\"\")","v":""},{"$f":"IF('crop k''s'!J187=1,\"OCT\",\"\")","v":""},{"$f":"IF('crop k''s'!K187=1,\"NOV\",\"\")","v":""},{"$f":"IF('crop k''s'!L187=1,\"DEC\",\"\")","v":""}]
[]
["ERROR"]
[{"$f":"CONCATENATE(IF(A188<>0,CONCATENATE(A188,\"   \"),\"\"),IF(B188<>0,CONCATENATE(B188,\"   \"),\"\"),IF(C188<>0,CONCATENATE(C188,\"   \"),\"\"),IF(D188<>0,CONCATENATE(D188,\"   \"),\"\"),IF(E188<>0,CONCATENATE(E188,\"   \"),\"\"),IF(F188<>0,CONCATENATE(F188,\"   \"),\"\"),IF(G188<>0,CONCATENATE(G188,\"   \"),\"\"),IF(H188<>0,CONCATENATE(H188,\"   \"),\"\"),IF(I188<>0,CONCATENATE(I188,\"   \"),\"\"),IF(J188<>0,CONCATENATE(J188,\"   \"),\"\"),IF(K188<>0,CONCATENATE(K188,\"   \"),\"\"),IF(L188<>0,CONCATENATE(L188,\"   \"),\"\"),\"\")","v":"                                    "}]
[{"$f":"IF(AND( A188=\"JAN\",B188=\"FEB\",C188=\"MAR\",D188=\"APR\",E188=\"MAY\",F188=\"JUN\",G188=\"JUL\",H188=\"AUG\",I188=\"SEP\",J188=\"OCT\",K188=\"NOV\",L188=\"DEC\"),\"YES\",0)","v":0},"12 MONTHS PLANTED"]

{"sheet":"Irr System","index":10,"n_rows":49,"n_cols":5,"rows_kept":49,"cut":false,"hidden":true,"merged":[]}
["2-in-10"]
[null,null,null,"With SWM","Without SWM"]
["01",1,"Micro-sprinkler",1.18,1.18]
["02",2,"Overhead Drip",1.18,1.18]
["03",13,"Seepage/Furrow",2.5,1.67]
["12",4,"Low Volume",1.18,1.18]
["05",15,"Crown Flooding",2.5,1.67]
["06",16,"Sub-irrigation",2.5,1.67]
["07",7,"Sprinkler",1.33,1.25]
["08",8,"Portable Gun",1.54,1.43]
["09",9,"Traveling Gun",1.43,1.33]
["10",10,"Overhead",1.33,1.25]
["11",3,"Nursery Container",5,2.86]
["04",14,"Semi-Closed Flow-Through",2.5,1.67]
["13",5,"Drip",1.18,1.18]
["14",17,"Surface Gravity",2.5,1.67]
["18",18,"Flood/Seepage",2.5,1.67]
["90",6,"Container",5,2.86]
["92",11,"Volume Gun",1.43,1.33]
["93",12,"Walking Gun",1.43,1.33]
["19",19,"E.A.A. Flood/Seepage",0,0]
["20",20,"Center pivot/Linear Move",0,0]
["94",21,"Low Volume/Canal Seepage Loss",0,0]
["95",22,"Flood/Canal Seepage Loss",0,0]
[]
["1-in-10"]
[null,null,null,"With SWM","Without SWM"]
["01",1,"Micro-sprinkler",1.18,1.18]
["02",2,"Overhead Drip",1.18,1.18]
["03",13,"Seepage/Furrow",2,2]
["12",4,"Low Volume",1.18,1.18]
["05",15,"Crown Flooding",2,2]
["06",16,"Sub-irrigation",2,2]
["07",7,"Sprinkler",1.3,1.3]
["08",8,"Portable Gun",1.5,1.5]
["09",9,"Traveling Gun",1.4,1.4]
["10",10,"Overhead",1.3,1.3]
["11",3,"Nursery Container",3.6,3.6]
["04",14,"Semi-Closed Flow-Through",2,2]
["13",5,"Drip",1.18,1.18]
["14",17,"Surface Gravity",2,2]
["18",18,"Flood/Seepage",2,2]
["90",6,"Container",3.6,3.6]
["92",11,"Volume Gun",1.5,1.5]
["93",12,"Walking Gun",1.4,1.4]
["19",19,"E.A.A. Flood/Seepage",1.33,1.33]
["20",20,"Center pivot/Linear Move",1.33,1.33]
["94",21,"Low Volume/Canal Seepage Loss",1.77,1.77]
["95",22,"Flood/Canal Seepage Loss",3,3]

{"sheet":"InputControl","index":11,"n_rows":160,"n_cols":7,"rows_kept":160,"cut":false,"hidden":true,"merged":[]}
[]
[]
[]
[]
[]
[]
[]
[]
[]
[]
["Return","Storm Event"]
[{"$f":"Input2!C2","v":"1-in-10"},{"$f":"VLOOKUP(A12,A13:B14,2,FALSE)","v":1}]
["1-in-10",1]
["2-in-10",2]
[]
["Return","Station Number"]
[{"$f":"Input2!C3","v":"Okeechobee     1-in-10"},{"$f":"VLOOKUP(A17,A18:B54,2,FALSE)","v":27}]
[{"$f":"IF(InputControl!$B$12=2,OFFSET('climo data'!$A$2,0,(InputControl!B18*4)-4)&\"     \"&$A$12,OFFSET('climo data'!$A$21,0,(InputControl!B18*4)-4)&\"     \"&$A$12)","v":"Archbold     1-in-10"},1]
[{"$f":"IF(InputControl!$B$12=2,OFFSET('climo data'!$A$2,0,(InputControl!B19*4)-4)&\"     \"&$A$12,OFFSET('climo data'!$A$21,0,(InputControl!B19*4)-4)&\"     \"&$A$12)","v":"Avon Park     1-in-10"},2]
[{"$f":"IF(InputControl!$B$12=2,OFFSET('climo data'!$A$2,0,(InputControl!B20*4)-4)&\"     \"&$A$12,OFFSET('climo data'!$A$21,0,(InputControl!B20*4)-4)&\"     \"&$A$12)","v":"Belle Glade     1-in-10"},3]
[{"$f":"IF(InputControl!$B$12=2,OFFSET('climo data'!$A$2,0,(InputControl!B21*4)-4)&\"     \"&$A$12,OFFSET('climo data'!$A$21,0,(InputControl!B21*4)-4)&\"     \"&$A$12)","v":"Big Cypress (No Data)     1-in-10"},4]
[{"$f":"IF(InputControl!$B$12=2,OFFSET('climo data'!$A$2,0,(InputControl!B22*4)-4)&\"     \"&$A$12,OFFSET('climo data'!$A$21,0,(InputControl!B22*4)-4)&\"     \"&$A$12)","v":"Clewiston     1-in-10"},5]
[{"$f":"IF(InputControl!$B$12=2,OFFSET('climo data'!$A$2,0,(InputControl!B23*4)-4)&\"     \"&$A$12,OFFSET('climo data'!$A$21,0,(InputControl!B23*4)-4)&\"     \"&$A$12)","v":"Everglades     1-in-10"},6]
[{"$f":"IF(InputControl!$B$12=2,OFFSET('climo data'!$A$2,0,(InputControl!B24*4)-4)&\"     \"&$A$12,OFFSET('climo data'!$A$21,0,(InputControl!B24*4)-4)&\"     \"&$A$12)","v":"Fellsmere (No Data)     1-in-10"},7]
[{"$f":"IF(InputControl!$B$12=2,OFFSET('climo data'!$A$2,0,(InputControl!B25*4)-4)&\"     \"&$A$12,OFFSET('climo data'!$A$21,0,(InputControl!B25*4)-4)&\"     \"&$A$12)","v":"Fort Drum     1-in-10"},8]
[{"$f":"IF(InputControl!$B$12=2,OFFSET('climo data'!$A$2,0,(InputControl!B26*4)-4)&\"     \"&$A$12,OFFSET('climo data'!$A$21,0,(InputControl!B26*4)-4)&\"     \"&$A$12)","v":"Ft. Lauderdale     1-in-10"},9]
[{"$f":"IF(InputControl!$B$12=2,OFFSET('climo data'!$A$2,0,(InputControl!B27*4)-4)&\"     \"&$A$12,OFFSET('climo data'!$A$21,0,(InputControl!B27*4)-4)&\"     \"&$A$12)","v":"Ft. Myers     1-in-10"},10]
[{"$f":"IF(InputControl!$B$12=2,OFFSET('climo data'!$A$2,0,(InputControl!B28*4)-4)&\"     \"&$A$12,OFFSET('climo data'!$A$21,0,(InputControl!B28*4)-4)&\"     \"&$A$12)","v":"Ft. Pierce     1-in-10"},11]
[{"$f":"IF(InputControl!$B$12=2,OFFSET('climo data'!$A$2,0,(InputControl!B29*4)-4)&\"     \"&$A$12,OFFSET('climo data'!$A$21,0,(InputControl!B29*4)-4)&\"     \"&$A$12)","v":"Hialeah     1-in-10"},12]
[{"$f":"IF(InputControl!$B$12=2,OFFSET('climo data'!$A$2,0,(InputControl!B30*4)-4)&\"     \"&$A$12,OFFSET('climo data'!$A$21,0,(InputControl!B30*4)-4)&\"     \"&$A$12)","v":"Homestead     1-in-10"},13]
[{"$f":"IF(InputControl!$B$12=2,OFFSET('climo data'!$A$2,0,(InputControl!B31*4)-4)&\"     \"&$A$12,OFFSET('climo data'!$A$21,0,(InputControl!B31*4)-4)&\"     \"&$A$12)","v":"Hypoluxo     1-in-10"},14]
[{"$f":"IF(InputControl!$B$12=2,OFFSET('climo data'!$A$2,0,(InputControl!B32*4)-4)&\"     \"&$A$12,OFFSET('climo data'!$A$21,0,(InputControl!B32*4)-4)&\"     \"&$A$12)","v":"Immokalee     1-in-10"},15]
[{"$f":"IF(InputControl!$B$12=2,OFFSET('climo data'!$A$2,0,(InputControl!B33*4)-4)&\"     \"&$A$12,OFFSET('climo data'!$A$21,0,(InputControl!B33*4)-4)&\"     \"&$A$12)","v":"Indiantown (No Data)     1-in-10"},16]
[{"$f":"IF(InputControl!$B$12=2,OFFSET('climo data'!$A$2,0,(InputControl!B34*4)-4)&\"     \"&$A$12,OFFSET('climo data'!$A$21,0,(InputControl!B34*4)-4)&\"     \"&$A$12)","v":"Jupiter     1-in-10"},17]
[{"$f":"IF(InputControl!$B$12=2,OFFSET('climo data'!$A$2,0,(InputControl!B35*4)-4)&\"     \"&$A$12,OFFSET('climo data'!$A$21,0,(InputControl!B35*4)-4)&\"     \"&$A$12)","v":"Kissimmee     1-in-10"},18]
[{"$f":"IF(InputControl!$B$12=2,OFFSET('climo data'!$A$2,0,(InputControl!B36*4)-4)&\"     \"&$A$12,OFFSET('climo data'!$A$21,0,(InputControl!B36*4)-4)&\"     \"&$A$12)","v":"La Belle     1-in-10"},19]
[{"$f":"IF(InputControl!$B$12=2,OFFSET('climo data'!$A$2,0,(InputControl!B37*4)-4)&\"     \"&$A$12,OFFSET('climo data'!$A$21,0,(InputControl!B37*4)-4)&\"     \"&$A$12)","v":"Lake Placid (No Data)     1-in-10"},20]
[{"$f":"IF(InputControl!$B$12=2,OFFSET('climo data'!$A$2,0,(InputControl!B38*4)-4)&\"     \"&$A$12,OFFSET('climo data'!$A$21,0,(InputControl!B38*4)-4)&\"     \"&$A$12)","v":"Loxahatchee     1-in-10"},21]
[{"$f":"IF(InputControl!$B$12=2,OFFSET('climo data'!$A$2,0,(InputControl!B39*4)-4)&\"     \"&$A$12,OFFSET('climo data'!$A$21,0,(InputControl!B39*4)-4)&\"     \"&$A$12)","v":"Melbourne (No Data)     1-in-10"},22]
[{"$f":"IF(InputControl!$B$12=2,OFFSET('climo data'!$A$2,0,(InputControl!B40*4)-4)&\"     \"&$A$12,OFFSET('climo data'!$A$21,0,(InputControl!B40*4)-4)&\"     \"&$A$12)","v":"Merritt Island (No Data)     1-in-10"},23]
[{"$f":"IF(InputControl!$B$12=2,OFFSET('climo data'!$A$2,0,(InputControl!B41*4)-4)&\"     \"&$A$12,OFFSET('climo data'!$A$21,0,(InputControl!B41*4)-4)&\"     \"&$A$12)","v":"Miami     1-in-10"},24]
[{"$f":"IF(InputControl!$B$12=2,OFFSET('climo data'!$A$2,0,(InputControl!B42*4)-4)&\"     \"&$A$12,OFFSET('climo data'!$A$21,0,(InputControl!B42*4)-4)&\"     \"&$A$12)","v":"Moore Haven     1-in-10"},25]
[{"$f":"IF(InputControl!$B$12=2,OFFSET('climo data'!$A$2,0,(InputControl!B43*4)-4)&\"     \"&$A$12,OFFSET('climo data'!$A$21,0,(InputControl!B43*4)-4)&\"     \"&$A$12)","v":"Naples     1-in-10"},26]
[{"$f":"IF(InputControl!$B$12=2,OFFSET('climo data'!$A$2,0,(InputControl!B44*4)-4)&\"     \"&$A$12,OFFSET('climo data'!$A$21,0,(InputControl!B44*4)-4)&\"     \"&$A$12)","v":"Okeechobee     1-in-10"},27]
[{"$f":"IF(InputControl!$B$12=2,OFFSET('climo data'!$A$2,0,(InputControl!B45*4)-4)&\"     \"&$A$12,OFFSET('climo data'!$A$21,0,(InputControl!B45*4)-4)&\"     \"&$A$12)","v":"Orlando(No Data)     1-in-10"},28]
[{"$f":"IF(InputControl!$B$12=2,OFFSET('climo data'!$A$2,0,(InputControl!B46*4)-4)&\"     \"&$A$12,OFFSET('climo data'!$A$21,0,(InputControl!B46*4)-4)&\"     \"&$A$12)","v":"Pompano Beach     1-in-10"},29]
[{"$f":"IF(InputControl!$B$12=2,OFFSET('climo data'!$A$2,0,(InputControl!B47*4)-4)&\"     \"&$A$12,OFFSET('climo data'!$A$21,0,(InputControl!B47*4)-4)&\"     \"&$A$12)","v":"Punta Gorda(No Data)     1-in-10"},30]
[{"$f":"IF(InputControl!$B$12=2,OFFSET('climo data'!$A$2,0,(InputControl!B48*4)-4)&\"     \"&$A$12,OFFSET('climo data'!$A$21,0,(InputControl!B48*4)-4)&\"     \"&$A$12)","v":"Stuart     1-in-10"},31]
[{"$f":"IF(InputControl!$B$12=2,OFFSET('climo data'!$A$2,0,(InputControl!B49*4)-4)&\"     \"&$A$12,OFFSET('climo data'!$A$21,0,(InputControl!B49*4)-4)&\"     \"&$A$12)","v":"S-65     1-in-10"},32]
[{"$f":"IF(InputControl!$B$12=2,OFFSET('climo data'!$A$2,0,(InputControl!B50*4)-4)&\"     \"&$A$12,OFFSET('climo data'!$A$21,0,(InputControl!B50*4)-4)&\"     \"&$A$12)","v":"S 140 W     1-in-10"},33]
[{"$f":"IF(InputControl!$B$12=2,OFFSET('climo data'!$A$2,0,(InputControl!B51*4)-4)&\"     \"&$A$12,OFFSET('climo data'!$A$21,0,(InputControl!B51*4)-4)&\"     \"&$A$12)","v":"Tamiami 4     1-in-10"},34]
[{"$f":"IF(InputControl!$B$12=2,OFFSET('climo data'!$A$2,0,(InputControl!B52*4)-4)&\"     \"&$A$12,OFFSET('climo data'!$A$21,0,(InputControl!B52*4)-4)&\"     \"&$A$12)","v":"Titusville (No Data)     1-in-10"},35]
[{"$f":"IF(InputControl!$B$12=2,OFFSET('climo data'!$A$2,0,(InputControl!B53*4)-4)&\"     \"&$A$12,OFFSET('climo data'!$A$21,0,(InputControl!B53*4)-4)&\"     \"&$A$12)","v":"Vero Beach (No Data)     1-in-10"},36]
[{"$f":"IF(InputControl!$B$12=2,OFFSET('climo data'!$A$2,0,(InputControl!B54*4)-4)&\"     \"&$A$12,OFFSET('climo data'!$A$21,0,(InputControl!B54*4)-4)&\"     \"&$A$12)","v":"West Palm Beach     1-in-10"},37]
[]
["Return","Crop Type"]
[{"$f":"Input2!C4","v":"Perennial-Nursery"},{"$f":"VLOOKUP(A57,A58:B87,2,FALSE)","v":5},{"$f":"VLOOKUP(B57,B58:C87,2,FALSE)","v":"Nursery"}]
["Perennial-Nursery",5,"Nursery"]
["Perennial-Sugarcane",10,"Sugarcane"]
["Perennial-Alfalfa",11,"Alfalfa"]
["Perennial-Avocado",12,"Avocado"]
["Perennial-Citrus",13,"Citrus"]
["Perennial-Grapes",14,"Grapes"]
["Perennial-Turf Grass",15,"Turf Grass"]
["Perennial-Blueberries",18,"Blueberries"]
["Perennial-Pasture",20,"Pasture"]
["Perennial-Papaya",21,"Papaya"]
["Perennial-Carambola",22,"Carambola"]
["Perennial-Tropical Fruit",23,"Tropical Fruit"]
["Perennial-Mangoes",24,"Mangoes"]
["Perennial-Palm Trees",25,"Palm Trees"]
["Annual-Dry Beans",51,"Dry Beans"]
["Annual-Green Bean",52,"Green Bean"]
["Annual-Grain Corn",53,"Grain Corn"]
["Annual-Silage Corn",54,"Silage Corn"]
["Annual-Sweet Corn",55,"Sweet Corn"]
["Annual-Melons",56,"Melons"]
["Annual-Peas",57,"Peas"]
["Annual-Potato",58,"Potato"]
["Annual-Soybeans",59,"Soybeans"]
["Annual-Tomato",60,"Tomato"]
["Annual-Small Vegetables",61,"Small Vegetables"]
["Annual-Winter Wheat",70,"Winter Wheat"]
["Annual-Peppers",64,"Peppers"]
["Annual-Hay",65,"Hay"]
["Annual-Strawberries",66,"Strawberries"]
["Annual-Sorghum",69,"Sorghum"]
[]
[{"$f":"Input2!C11","v":"Drip"},{"$f":"VLOOKUP(A89,irrsystable,2,FALSE)","v":"13"},null,null,"Micro Irrigation-","Sprinkler Systems-","Sub Irrigation-"]
["Micro-sprinkler","01",null,null,{"$f":"E$89&A90","v":"Micro Irrigation-Micro-sprinkler"}]
["Overhead Drip","02",null,null,{"$f":"E$89&A91","v":"Micro Irrigation-Overhead Drip"}]
["Drip","13",null,null,{"$f":"E$89&A92","v":"Micro Irrigation-Drip"}]
["Low Volume","12",null,null,{"$f":"E$89&A93","v":"Micro Irrigation-Low Volume"}]
["Container","90",null,null,{"$f":"F$89&A94","v":"Sprinkler Systems-Container"}]
["Nursery Container","11",null,null,{"$f":"F$89&A95","v":"Sprinkler Systems-Nursery Container"}]
["Sprinkler","07",null,null,"Sprinkler Systems-Sprinkler"]
["Portable Gun","08",null,null,"Sprinkler Systems-Portable Gun"]
["Traveling Gun","09",null,null,"Sprinkler Systems-Traveling Gun"]
["Overhead","10",null,null,"Sprinkler Systems-Overhead"]
["Volume Gun","92",null,null,"Sprinkler Systems-Volume Gun"]
["Walking Gun","93",null,null,"Sprinkler Systems-Walking Gun"]
["Seepage/Furrow","03",null,null,{"$f":"G$89&A102","v":"Sub Irrigation-Seepage/Furrow"}]
["Semi-Closed Flow-Through","04",null,null,"Sub Irrigation-Semi-Closed Flow-Through"]
["Crown Flooding","05",null,null,"Sub Irrigation-Crown Flooding"]
["Sub-irrigation","06",null,null,"Sub Irrigation-Sub-irrigation"]
["Surface Gravity","14",null,null,"Sub Irrigation-Surface Gravity"]
["Flood/Seepage","18",null,null,"Sub Irrigation-Flood/Seepage"]
["E.A.A. Flood/Seepage","19",null,null,"Sub Irrigation-E.A.A. Flood/Seepage"]
["Center pivot/Linear Move","20",null,null,"Sub Irrigation-Center pivot/Linear Move"]
["Low Volume/Canal Seepage Loss","94",null,null,"Sub Irrigation-Low Volume/Canal Seepage Loss"]
["Flood/Canal Seepage Loss","95",null,null,"Sub Irrigation-Flood/Canal Seepage Loss"]
[]
[{"$f":"Input2!C7","v":"4 months"},{"$f":"VLOOKUP(A113,A114:B125,1,FALSE)","v":"4 months"},{"$f":"VLOOKUP(A113,A114:C125,2,FALSE)+1","v":5},"Col"]
["1 month",1]
["2 months",2]
["3 months",3]
["4 months",4]
["5 months",5]
["6 months",6]
["7 months",7]
["8 months",8]
["9 months",9]
["10 months",10]
["11 months",11]
["12 months",12]
[]
[{"$f":"Input2!C10","v":0.8},{"$f":"VLOOKUP(A127,ST,1,FALSE)","v":0.8}," "]
["0.2","1"]
[0.4,"2"]
[0.8,"3"]
[1.5,"4"]
[3.6,"5"]
[]
[]
[null,null,null,null,"Salt Flush"]
[null,"Yes",null,null,"Yes"]
[null,"No",null,null,"No"]
[]
[]
[]
[false,"January"]
[false,"February"]
[false,"March"]
[true,"April"]
[false,"May"]
[false,"June"]
[false,"July"]
[true,"August"]
[false,"September"]
[true,"October"]
[false,"November"]
[false,"December"]
[]
[]
["1-in-10 Citrus using Microjet Systems (Maximum Full ET for the Months Mar,Apr,May)"]
[{"$f":"IF((InputControl!$B$57=13)*AND(OR(InputControl!$B$89=\"01\",InputControl!$B$89=\"02\",InputControl!$B$89=\"13\",InputControl!$B$89=\"12\"))*AND($B$12=1),MAX(Exhibit!E21:G21),0)","v":0},{"$f":"IF(A156<>0, MATCH(MAX(Exhibit!E21:'Exhibit'!G21),Exhibit!E21:'Exhibit'!G21,0),\"\")","v":""},{"$f":"IF(B156=1, \"MAR\",IF(B156=2,\"APR\",IF(B156=3,\"MAY\",\"\")))","v":""}]
["2-in-10 Citrus","Location","Month"]
[{"$f":"IF((InputControl!$B$57=13)*AND(InputControl!$B$12=2),MAX(Exhibit!C21:N21),0)","v":0}]
["If Citrus"]
[{"$f":"IF((InputControl!$B$57=13)*AND(InputControl!$A$156=0),InputControl!$A$158,InputControl!$A$156)","v":0}]