{"text_format":"1","workbook":"xlsx","n_sheets":12,"sheets":["Read","Part B","Update Info","Input2","Exhibit","Exhibit Totals","Blaney Calc","Crop Count","climo data","crop k's","Irr System","InputControl"],"not_rendered":{"charts":0,"images":1,"macros":1,"external_links":0,"defined_names":9,"comments":0,"pivot_tables":0},"unopened":[],"bounds":{"document_bytes":16777216,"sheet_cells":100000,"rows_first":2000,"rows_last":500,"rows_between":2000,"halvings":0,"cell_chars":16384,"cell_head_chars":4096},"cells_cut":0,"cells_raw":0,"read":"whole","date_system":"1900"}

{"sheet":"Read","index":0,"n_rows":16,"n_cols":4,"rows_kept":16,"cut":false,"hidden":false,"merged":[]}
[]
[]
[null,null,null,"Modified Blaney-Criddle for Excel"]
[]
[]
[null,null,null,"This allocation program which calculates a maximum monthly supplemental crop requirement and an average annual supplemental requirement using the Modified Blaney-Criddle method."]
{"$rows_left_out":11}
{"sheet":"Part B","index":1,"n_rows":459,"n_cols":13,"rows_kept":459,"cut":false,"hidden":false,"merged":[[159,0,159,12],[161,0,162,12],[172,0,172,12],[174,0,176,0],[174,1,176,1],[174,2,176,4],[174,5,176,5],[174,6,176,6],[174,7,174,10],[174,11,176,11],[174,12,176,12],[175,7,175,10],[176,7,176,10],[177,0,178,0],[177,1,178,1],[177,2,178,4],[177,5,178,5],[177,6,178,6],[177,7,177,10],[177,11,178,11],[254,1,254,12],[177,12,178,12],[178,7,178,10],[221,1,221,12],[222,1,222,12],[229,1,229,12],[230,1,230,12],[237,1,237,12],[238,1,238,12],[245,1,245,12],[246,1,246,12],[253,1,253,12],[309,1,309,12],[261,1,261,12],[262,1,262,12],[276,1,276,12],[277,1,277,12],[284,1,284,12],[285,1,285,12],[292,1,292,12],[293,1,293,12],[300,1,300,12],[301,1,301,12],[308,1,308,12],[363,1,363,12],[316,1,316,12],[317,1,317,12],[331,1,331,12],[332,1,332,12],[338,1,338,12],[339,1,339,12],[346,1,346,12],[347,1,347,12],[354,1,354,12],[355,1,355,12],[362,1,362,12],[419,1,419,12],[370,1,370,12],[371,1,371,12],[386,1,386,12],[387,1,387,12],[394,1,394,12],[395,1,395,12],[402,1,402,12],[403,1,403,12],[410,1,410,12],[411,1,411,12],[418,1,418,12],[450,1,450,12],[457,1,457,12],[458,1,458,12],[426,1,426,12],[427,1,427,12],[441,1,441,12],[442,1,442,12],[449,1,449,12]]}
[]
[]
[]
[null,null,null,null,null,null,null,"PART B"]
[]
[null,null,null,null,null,null,null,"WATER USE MANAGEMENT SYSTEM"]
{"$rows_left_out":454}
{"sheet":"Update Info","index":2,"n_rows":20,"n_cols":1,"rows_kept":20,"cut":false,"hidden":false,"merged":[]}
[]
[]
["Revisions to Spreadsheet"]
["2014-01-01"]
["This revised Excel program for the Modified Blaney-Criddle equation was designed with a Macro button in order to allow the summation of multiple supplemental irrigation crop demands. The summation results are outputted into a new “Exhibit Totals” sheet.  The “Exhibit” sheet is similar to the previous spreadsheet versions and should be used to print the results of each crop. This Exhibit has been updated to include planting information for annual crops, crop numbering for single and multiple planting within a parcel, parcel naming, and exhibit labeling.  The “Input2” sheet has been revised to include inputs for the total number of parcels, parcel names, the number of multiple planting within a single parcel, and the  exhibit numbering for both the “Exhibit” and “Exhibit Totals” sheets. In addition, a quick view calculation screen, an error notifying cell, a crop input button and a counter for the total number of crop parcels processed and multiple crops in a parcel processed. This revised spreadsheet also includes additional annual growing season lengths (1 to 12 months) and updated significant digit formatting of calculated output."]
["2014-02-01"]
{"$rows_left_out":15}
{"sheet":"Input2","index":3,"n_rows":75,"n_cols":20,"rows_kept":75,"cut":false,"hidden":false,"merged":[[13,4,13,5],[13,6,13,7],[6,2,6,7],[4,9,4,14],[3,9,3,14],[5,10,5,15],[9,2,9,7],[6,10,6,15],[7,9,8,12],[7,13,8,15],[10,9,10,12],[10,13,10,15],[9,13,9,15],[9,9,9,12],[1,15,2,15],[3,15,4,15],[3,2,3,7],[1,2,1,7],[2,2,2,7],[2,9,2,14],[1,9,1,14],[21,9,21,15],[20,2,21,7],[15,2,15,7],[14,2,14,7],[10,2,10,7],[12,9,12,15],[11,2,11,7],[12,2,12,7],[13,9,13,15],[11,9,11,15],[19,2,19,7],[16,2,16,7],[17,2,17,7],[18,2,18,7],[14,9,14,15],[13,2,13,3]]}
[null,null,"Drop Down Menus"]
[null,"Rainfall Event","1-in-10",null,null,null,null,null,null,"Total number of crop parcels (Fields)      Must be > = 1",null,null,null,null,null,1]
[null,"Rainfall Station Name","Okeechobee     1-in-10",null,null,null,null,null,null,"DO NOT CHANGE WHILE \"TOTAL CROPS PARCELS\" IS PROCESSING"]
[null,"Crop Type","Perennial-Nursery",null,null,null,null,null,null,"How many different annual crops will be planted on this parcel?         (If there are no annuals being re-planted in the same area, Input = 1)",null,null,null,null,null,1]
[null,"Check each month crop is being planted (Multiple plantings of same crop)",null,null,null,null,null,null,null,"DO NOT CHANGE WHILE \"MULTIPLE CROPS IN PARCEL\" IS PROCESSING"]
[null,"(Only Needed For Annual Crops)",null,null,null,null,null,null,null,0,"TOTAL CROP PARCELS COMPLETED"]
{"$rows_left_out":70}
{"sheet":"Exhibit","index":4,"n_rows":56,"n_cols":15,"rows_kept":56,"cut":false,"hidden":false,"merged":[[2,1,2,11],[3,13,3,14],[2,12,2,13],[7,2,7,3],[55,13,55,15],[5,8,5,9],[6,8,6,9],[6,10,6,15],[7,7,7,9]]}
[]
[]
[null,"Calculations of Irrigation Requirements",null,null,null,null,null,null,null,null,null,null,{"$f":"IF(InputControl!$B$12=2,\"(2-in-10)\",\"(1-in-10)\")","v":"(1-in-10)"}]
[null,null,null,null,null,null,null,null,null,null,null,null,null," "]
[]
[null,"Rainfall Station:",{"$f":"Input2!C3","v":"Okeechobee     1-in-10"},null,null,null,null,null,"Crop No.:",null,1,null,null,null,1]
{"$rows_left_out":51}
{"sheet":"Exhibit Totals","index":5,"n_rows":53,"n_cols":17,"rows_kept":53,"cut":false,"hidden":false,"merged":[[52,12,52,14],[47,12,47,13],[45,12,45,13],[49,12,49,13],[15,7,15,9],[45,10,45,11],[49,10,49,11],[41,12,41,13],[43,12,43,13],[19,7,19,9],[21,10,21,11],[21,12,21,13],[17,10,17,11],[17,12,17,13],[37,12,37,13],[11,2,11,6],[39,2,39,6],[39,7,39,9],[39,10,39,11],[39,12,39,13],[11,7,11,9],[25,10,25,11],[19,10,19,11],[21,2,21,6],[21,7,21,9],[11,10,11,11],[17,2,17,6],[17,7,17,9],[11,12,11,13],[15,2,15,6],[13,10,13,11],[2,14,2,15],[19,12,19,13],[4,7,4,9],[4,10,4,11],[7,10,7,11],[4,12,4,13],[9,7,9,9],[15,12,15,13],[13,7,13,9],[7,12,7,13],[9,10,9,11],[9,12,9,13],[7,7,7,9],[15,10,15,11],[51,2,51,6],[51,7,51,9],[47,2,47,6],[47,7,47,9],[47,10,47,11],[43,2,43,6],[43,7,43,9],[43,10,43,11],[49,2,49,6],[49,7,49,9],[45,2,45,6],[45,7,45,9],[41,2,41,6],[41,7,41,9],[41,10,41,11],[23,10,23,11],[25,7,25,9],[37,2,37,6],[37,7,37,9],[37,10,37,11],[13,2,13,6],[35,2,35,6],[35,7,35,9],[35,10,35,11],[35,12,35,13],[33,2,33,6],[33,7,33,9],[33,10,33,11],[33,12,33,13],[13,12,13,13],[31,12,31,13],[29,2,29,6],[25,2,25,6],[25,12,25,13],[27,2,27,6],[19,2,19,6],[9,2,9,6],[31,2,31,6],[31,7,31,9],[31,10,31,11],[2,3,2,13],[7,2,7,6],[4,2,4,6],[29,7,29,9],[29,10,29,11],[27,7,27,9],[27,10,27,11],[27,12,27,13],[29,12,29,13],[23,2,23,6],[23,7,23,9],[23,12,23,13]]}
[]
[]
[null,null,null,"Summation of All Irrigation Requirements",null,null,null,null,null,null,null,null,null,null,{"$f":"IF(InputControl!$B$12=2,\"(2-in-10)\",\"(1-in-10)\")","v":"(1-in-10)"}]
[]
[null,"No.","Parcel Name",null,null,null,null,"Crop",null,null,"acres",null,"Plant No. in Parcel",null,"Multiple Plantings in Parcel","Salt Flush"]
[null,"Inches","Jan","Feb","Mar","Apr","May","Jun","Jul","Aug","Sep","Oct","Nov","Dec","Mx Mon","Annual"," "]
{"$rows_left_out":48}
{"sheet":"Blaney Calc","index":6,"n_rows":34,"n_cols":16,"rows_kept":34,"cut":false,"hidden":true,"merged":[[0,0,0,1],[21,10,21,11],[19,3,19,4]]}
[{"$f":"IF(InputControl!$B$12=2,\"2-in-10 Data Input\",\"1-in-10 Data Input\")","v":"1-in-10 Data Input"},null,{"$f":"IF(InputControl!$B$12=2,OFFSET('climo data'!$A$2,0,(InputControl!$B$17*4)-4),OFFSET('climo data'!$A$21,0,(InputControl!$B$17*4)-4))","v":"Okeechobee"},null,null,{"$f":"IF(InputControl!$B$57<50,VLOOKUP(\"b\",'crop k''s'!$A$2:$Q$3,'crop k''s'!D104,FALSE),VLOOKUP(\"b\",'crop k''s'!$A$18:$U$19,'crop k''s'!D104,FALSE))","v":"Nursery"},"Calculate et and effective average rain"]
["rain",{"$f":"IF(InputControl!$B$12=2,\"2-in-10 Rainfall (inches)\",\"1-in-10 Rainfall (inches)\")","v":"1-in-10 Rainfall (inches)"},"Temp","sun","Soil","coeff","F(M) (5)","AKT(M)(6)","AKTF(M)(7)","U(M) (8)","RT1(M)(9)","U1(M) (10)","F1          (11)","RE(M) (12)",{"$f":"IF(InputControl!$B$12=2,\"(7)       2-in-10\",\"(7)       1-in-10\")","v":"(7)       1-in-10"},{"$f":"IF(InputControl!$B$12=2,\"(10)      2-in-10\",\"(10)      1-in-10\")","v":"(10)      1-in-10"}]
[]
[{"$f":"IF(InputControl!$B$12=2,OFFSET('climo data'!A4,0,(InputControl!$B$17*4)-4),OFFSET('climo data'!A23,0,(InputControl!$B$17*4)-4))","v":1.76},{"$f":"IF(InputControl!$B$12=2,ROUND((OFFSET('climo data'!A4,0,(InputControl!$B$17*4)-4)*OFFSET('climo data'!$A$17,0,(InputControl!$B$17*4)-2)),2),ROUND((OFFSET('climo data'!A23,0,(InputControl!$B$17*4)-4)*OFFSET('climo data'!$A$36,0,(InputControl!$B$17*4)-2)),2))","v":1.44},{"$f":"IF(InputControl!$B$12=2,OFFSET('climo data'!A4,0,(InputControl!$B$17*4)-2),OFFSET('climo data'!A23,0,(InputControl!$B$17*4)-2))","v":62.03},{"$f":"IF(InputControl!$B$12=2,OFFSET('climo data'!A4,0,(InputControl!$B$17*4)-1),OFFSET('climo data'!A23,0,(InputControl!$B$17*4)-1))","v":7.43},{"$f":"InputControl!$B$127","v":0.8},{"$f":"IF(InputControl!$B$57<50,VLOOKUP(\"a\",'crop k''s'!$A$4:$Q$15,'crop k''s'!$D$104,FALSE),'crop k''s'!P69)","v":0.49},{"$f":"(C4*D4)/100","v":4.6088290000000001},{"$f":"(0.0173*C4)-0.314","v":0.75911899999999999},{"$f":"(G4*H4)","v":3.49865},{"$f":"(I4*F4)","v":1.7143390000000001},{"$f":"(0.70917*(A4^0.82416)-0.11556)","v":1.014475},{"$f":"10^(0.02426*J4)","v":1.1005},{"$f":"0.531747+(0.295154*$E$4)-(0.057697*$E$4^2)+(0.003804*$E$4^3)","v":0.73289199999999999},{"$f":"(K4*L4*M4)","v":0.818222},{"$f":"IF(InputControl!$B$12=2,(0.70917*(A4^0.82416)-0.11556),(0.70917*(A4^0.82416)-0.11556))","v":1.014475},{"$f":"IF(InputControl!$B$12=2,(O4*L4*M4)*OFFSET('climo data'!$C$17,0,(InputControl!$B$17*4)-4),(O4*L4*M4)*OFFSET('climo data'!$C$36,0,(InputControl!$B$17*4)-4))","v":0.67094200000000004}]
[{"$f":"IF(InputControl!$B$12=2,OFFSET('climo data'!A5,0,(InputControl!$B$17*4)-4),OFFSET('climo data'!A24,0,(InputControl!$B$17*4)-4))","v":2.19},{"$f":"IF(InputControl!$B$12=2,ROUND((OFFSET('climo data'!A5,0,(InputControl!$B$17*4)-4)*OFFSET('climo data'!$A$17,0,(InputControl!$B$17*4)-2)),2),ROUND((OFFSET('climo data'!A24,0,(InputControl!$B$17*4)-4)*OFFSET('climo data'!$A$36,0,(InputControl!$B$17*4)-2)),2))","v":1.8},{"$f":"IF(InputControl!$B$12=2,OFFSET('climo data'!A5,0,(InputControl!$B$17*4)-2),OFFSET('climo data'!A24,0,(InputControl!$B$17*4)-2))","v":63.93},{"$f":"IF(InputControl!$B$12=2,OFFSET('climo data'!A5,0,(InputControl!$B$17*4)-1),OFFSET('climo data'!A24,0,(InputControl!$B$17*4)-1))","v":7.09},null,{"$f":"IF(InputControl!$B$57<50,VLOOKUP(\"b\",'crop k''s'!$A$4:$Q$15,'crop k''s'!$D$104,FALSE),'crop k''s'!P70)","v":0.56999999999999995},4.5326370000000002,0.79198900000000005,3.5897990000000002,2.0461849999999999,1.2375430000000001,1.1210899999999999,{"$f":"0.531747+(0.295154*$E$4)-(0.057697*$E$4^2)+(0.003804*$E$4^3)","v":0.73289199999999999},1.016812,{"$f":"IF(InputControl!$B$12=2,(0.70917*(A5^0.82416)-0.11556),(0.70917*(A5^0.82416)-0.11556))","v":1.2375430000000001},{"$f":"IF(InputControl!$B$12=2,(O5*L5*M5)*OFFSET('climo data'!$C$17,0,(InputControl!$B$17*4)-4),(O5*L5*M5)*OFFSET('climo data'!$C$36,0,(InputControl!$B$17*4)-4))","v":0.83378600000000003}]
[{"$f":"IF(InputControl!$B$12=2,OFFSET('climo data'!A6,0,(InputControl!$B$17*4)-4),OFFSET('climo data'!A25,0,(InputControl!$B$17*4)-4))","v":2.89},{"$f":"IF(InputControl!$B$12=2,ROUND((OFFSET('climo data'!A6,0,(InputControl!$B$17*4)-4)*OFFSET('climo data'!$A$17,0,(InputControl!$B$17*4)-2)),2),ROUND((OFFSET('climo data'!A25,0,(InputControl!$B$17*4)-4)*OFFSET('climo data'!$A$36,0,(InputControl!$B$17*4)-2)),2))","v":2.37},{"$f":"IF(InputControl!$B$12=2,OFFSET('climo data'!A6,0,(InputControl!$B$17*4)-2),OFFSET('climo data'!A25,0,(InputControl!$B$17*4)-2))","v":67.84},{"$f":"IF(InputControl!$B$12=2,OFFSET('climo data'!A6,0,(InputControl!$B$17*4)-1),OFFSET('climo data'!A25,0,(InputControl!$B$17*4)-1))","v":8.3800000000000008},null,{"$f":"IF(InputControl!$B$57<50,VLOOKUP(\"c\",'crop k''s'!$A$4:$Q$15,'crop k''s'!$D$104,FALSE),'crop k''s'!P71)","v":0.73},5.6849920000000003,0.85963199999999995,4.8870009999999997,3.5675110000000001,1.5850470000000001,1.2205280000000001,0.73289199999999999,1.4178489999999999,{"$f":"IF(InputControl!$B$12=2,(0.70917*(A6^0.82416)-0.11556),(0.70917*(A6^0.82416)-0.11556))","v":1.5850470000000001},{"$f":"IF(InputControl!$B$12=2,(O6*L6*M6)*OFFSET('climo data'!$C$17,0,(InputControl!$B$17*4)-4),(O6*L6*M6)*OFFSET('climo data'!$C$36,0,(InputControl!$B$17*4)-4))","v":1.162636}]
{"$rows_left_out":29}
{"sheet":"Crop Count","index":7,"n_rows":57,"n_cols":42,"rows_kept":57,"cut":false,"hidden":false,"merged":[[1,1,1,2]]}
[null,"Total Count of Crops"]
[" ",0]
[]
[null,null,null,null,"SINGLE REVIEW INPUT",null,null,null,null,null,null,null,null,null,null,"CITRUS                       SALT FLUSH","CITRUS                       SALT FLUSH","CITRUS                       SALT FLUSH"]
["Crop No.","Plant No. in Parcel","Multiple Plantings in Parcel","Salt Flush","Parcel Name","Crop No.","Crop","Acreage","Rainfall Station","Irrigation System","Irrigation System Multiplier","Soil","Calculations",{"$f":"Exhibit!$C$19","v":"Jan"},{"$f":"Exhibit!$D$19","v":"Feb"},{"$f":"Exhibit!$E$19","v":"Mar"},{"$f":"Exhibit!$F$19","v":"Apr"},{"$f":"Exhibit!$G$19","v":"May"},{"$f":"Exhibit!$H$19","v":"Jun"},{"$f":"Exhibit!$I$19","v":"Jul"},{"$f":"Exhibit!$J$19","v":"Aug"},{"$f":"Exhibit!$K$19","v":"Sep"},{"$f":"Exhibit!$L$19","v":"Oct"},{"$f":"Exhibit!$M$19","v":"Nov"},{"$f":"Exhibit!$N$19","v":"Dec"},{"$f":"Exhibit!$O$19","v":"Total"},"Max Month (Value)","Max Month (Month)","Max Month (Citrus Value)","Max Month (Citrus Month)","Multiple Plantings in Parcel (Max Month)","Annual","Max Month (MG)","ANNUAL (MG)","SALT FLUSH (MG)"]
[null,null,null,{"$f":"IF((InputControl!$B$57=13)*AND(InputControl!$A$160<>0)*AND(Input2!$C$14=\"YES\"),\"YES\",\"NO\")","v":"NO"},{"$f":"IF(Input2!N8<>\"\",Input2!N8,\" \")","v":" "},{"$f":"InputControl!B57","v":5},{"$f":"Exhibit!C9","v":"Nursery"},{"$f":"Exhibit!C8","v":1},{"$f":"Exhibit!C6","v":"Okeechobee     1-in-10"},{"$f":"Exhibit!C7","v":"Drip"},{"$f":"Exhibit!C11","v":1.18},{"$f":"Exhibit!C10","v":0.8},{"$f":"Exhibit!B25","v":"1-in-10 Irrigation (inches)"},{"$f":"Exhibit!C25","v":1.04},{"$f":"Exhibit!D25","v":1.22},{"$f":"IF((InputControl!$B$57=13)*AND(InputControl!$A$160<>0)*AND(InputControl!$B$156=1),InputControl!A160,Exhibit!E25)","v":2.41},{"$f":"IF((InputControl!$B$57=13)*AND(InputControl!$A$160<>0)*AND(InputControl!$B$156=2),InputControl!A160,Exhibit!F25)","v":3.75},{"$f":"IF((InputControl!$B$57=13)*AND(InputControl!$A$160<>0)*AND(InputControl!$B$156=3),InputControl!A160,Exhibit!G25)","v":4.66},{"$f":"Exhibit!H25","v":4.17},{"$f":"Exhibit!I25","v":4.8600000000000003},{"$f":"Exhibit!J25","v":4.5},{"$f":"Exhibit!K25","v":3.59},{"$f":"Exhibit!L25","v":3.05},{"$f":"Exhibit!M25","v":2.21},{"$f":"Exhibit!N25","v":1.39},{"$f":"SUM(N6:Y6)","v":36.85},{"$f":"MAX(N6:Y6)","v":4.8600000000000003},"MAY",{"$f":"IF((InputControl!$B$57=13)*AND(InputControl!$A$160<>0),InputControl!A160,\"\")","v":""},{"$f":"IF((InputControl!$B$57=13)*AND(InputControl!$A$160<>0),InputControl!C156,\"\")","v":""},null,{"$f":"Exhibit!O25","v":36.85},{"$f":"IF((InputControl!$B$57=13)*AND(InputControl!$A$160<>0),AC6*H6*K6*0.02715,AA6*H6*K6*0.02715)","v":0.15570000000000001},{"$f":"AF6*H6*K6*0.02715","v":1.180563},"WITHOUT SALT FLUSH"]
{"$rows_left_out":52}
{"sheet":"climo data","index":8,"n_rows":44,"n_cols":148,"rows_kept":44,"cut":false,"hidden":true,"merged":[]}
["2-in-10"]
["Archbold (No Data)",null,null,null,"Avon Park",null,null,null,"Belle Glade",null,null,null,"Big Cypress",null,null,null,"Clewiston",null,null,null,"Everglades",null,null,null,"Fellsmere",null,null,null,"Fort Drum (No Data)",null,null,null,"Ft. Lauderdale",null,null,null,"Ft. Myers",null,null,null,"Ft. Pierce",null,null,null,"Hialeah",null,null,null,"Homestead",null,null,null,"Hypoluxo",null,null,null,"Immokalee (No Data)",null,null,null,"Indiantown",null,null,null,"Jupiter",null,null,null,"Kissimmee",null,null,null,"La Belle",null,null,null,"Lake Placid",null,null,null,"Loxahatchee",null,null,null,"Melbourne",null,null,null,"Merritt Island",null,null,null,"Miami",null,null,null,"Moore Haven",null,null,null,"Naples",null,null,null,"Okeechobee",null,null,null,"Orlando",null,null,null,"Pompano Beach",null,null,null,"Punta Gorda (No Data)",null,null,null,"Stuart",null,null,null,"S-65 (No Data)",null,null,null,"S 140 W (No Data)",null,null,null,"Tamiami 4",null,null,null,"Titusville",null,null,null,"Vero Beach",null,null,null,"West Palm Beach"]
[null,null,null,null,"Rain",null,"Temp","Sun","Rain",null,"Temp","Sun","Rain",null,"Temp","Sun","Rain",null,"Temp","Sun","Rain",null,"Temp","Sun","Rain",null,"Temp","Sun",null,null,null,null,"Rain",null,"Temp","Sun","Rain",null,"Temp","Sun","Rain",null,"Temp","Sun","Rain",null,"Temp","Sun","Rain",null,"Temp","Sun","Rain",null,"Temp","Sun",null,null,null,null,"Rain",null,"Temp","Sun","Rain",null,"Temp","Sun","Rain",null,"Temp","Sun","Rain",null,"Temp","Sun","Rain",null,"Temp","Sun","Rain",null,"Temp","Sun","Rain",null,"Temp","Sun","Rain",null,"Temp","Sun","Rain",null,"Temp","Sun","Rain",null,"Temp","Sun","Rain",null,"Temp","Sun","Rain",null,"Temp","Sun","Rain",null,"Temp","Sun","Rain",null,"Temp","Sun",null,null,null,null,"Rain",null,"Temp","Sun",null,null,null,null,null,null,null,null,"Rain",null,"Temp","Sun","Rain",null,"Temp","Sun","Rain",null,"Temp","Sun","Rain",null,"Temp","Sun"]
[null,null,null,null,2.17,null,63.46,7.42,1.88,null,63.17,7.46,1.69,null,62.74,7.48,1.31,null,63.45,7.45,1.63,null,66.3,7.49,2.2000000000000002,null,62.96,7.41,null,null,null,null,2.54,null,67.739999999999995,7.49,1.9,null,64.319999999999993,7.46,2.44,null,64.7,7.42,2.1,null,65.91,7.49,1.67,null,65.8,7.52,2.89,null,67.72,7.46,null,null,null,null,2.23,null,63.97,7.44,3.66,null,67.989999999999995,7.44,2.35,null,61.07,7.39,1.62,null,63.79,7.45,1.83,null,62.83,7.43,2.44,null,64.150000000000006,7.46,2.04,null,61.55,7.4,2.65,null,62.49,7.38,2.58,null,67.510000000000005,7.5,1.54,null,63.43,7.44,1.81,null,65.56,7.49,1.75,null,62.69,7.43,2.2999999999999998,null,61.27,7.38,2.41,null,67.099999999999994,7.48,null,null,null,null,2.34,null,65.489999999999995,7.44,null,null,null,null,null,null,null,null,1.44,null,67.12,7.5,2.14,null,61.26,7.37,2.0499999999999998,null,63.05,7.41,2.42,null,66.33,7.47]
[null,null,null,null,2.71,null,64.709999999999994,7.08,1.87,null,64.150000000000006,7.11,2.59,null,63.2,7.12,1.89,null,65.569999999999993,7.1,1.68,null,67.41,7.12,2.2999999999999998,null,64.28,7.08,null,null,null,null,2.2599999999999998,null,68.11,7.12,2.16,null,65.36,7.11,2.66,null,65.569999999999993,7.09,1.9,null,66.53,7.12,1.73,null,66.599999999999994,7.13,2.72,null,68.09,7.11,null,null,null,null,3.08,null,65.41,7.1,2.4900000000000002,null,67.77,7.1,2.84,null,62.42,7.06,2.2599999999999998,null,65.08,7.1,2.4500000000000002,null,64.95,7.09,2.56,null,64.75,7.11,2.72,null,63.2,7.07,2.54,null,63.68,7.06,2.14,null,67.94,7.13,1.9,null,64.59,7.1,2.02,null,66.58,7.12,2,null,64.180000000000007,7.09,2.4300000000000002,null,63.12,7.06,2.34,null,67.459999999999994,7.12,null,null,null,null,2.46,null,66.349999999999994,7.1,null,null,null,null,null,null,null,null,1.46,null,68.75,7.12,2.39,null,62.9,7.06,2.4500000000000002,null,64.63,7.08,2.54,null,66.88,7.11]
[null,null,null,null,2.6,null,68.12,8.3699999999999992,2.89,null,66.92,8.3800000000000008,1.83,null,67.069999999999993,8.3800000000000008,1.94,null,69.400000000000006,8.3800000000000008,2,null,69.94,8.3800000000000008,3.05,null,67.27,8.3699999999999992,null,null,null,null,2.62,null,70.44,8.3800000000000008,2.21,null,68.62,8.3800000000000008,2.96,null,68.31,8.3800000000000008,2.0499999999999998,null,70.069999999999993,8.3800000000000008,2.36,null,69.36,8.39,3.18,null,69.94,8.3800000000000008,null,null,null,null,3.14,null,68.260000000000005,8.3800000000000008,3.26,null,70.38,8.3800000000000008,3.11,null,66.430000000000007,8.3699999999999992,2.74,null,68.569999999999993,8.3800000000000008,2.65,null,68.67,8.3800000000000008,3.18,null,68.17,8.3800000000000008,3.17,null,66.89,8.3699999999999992,2.93,null,66.8,8.3699999999999992,2.44,null,70.88,8.3800000000000008,2.4,null,67.98,8.3800000000000008,2.11,null,69.81,8.3800000000000008,3.05,null,67.489999999999995,8.3800000000000008,2.81,null,66.8,8.3699999999999992,2.38,null,70.7,8.3800000000000008,null,null,null,null,2.98,null,69.87,8.3800000000000008,null,null,null,null,null,null,null,null,1.89,null,70.819999999999993,8.3800000000000008,3.15,null,65.92,8.3699999999999992,3.58,null,68.06,8.3699999999999992,2.84,null,70.19,8.3800000000000008]
{"$rows_left_out":39}
{"sheet":"crop k's","index":9,"n_rows":192,"n_cols":28,"rows_kept":192,"cut":false,"hidden":true,"merged":[]}
["Perennials"]
["a",5,10,11,12,13,14,15,18,20,21,22,23,24,25]
["b","Nursery","Sugarcane","Alfalfa","Avocado","Citrus","Grapes","Turf Grass","Blueberries","Pasture","Papaya","Carambola","Tropical Fruit","Mangoes","Palm Trees"]
["a",0.49,0.39,0.63,0.27,0.63,0.2,0.49,0.63,0.46,0.63,0.63,0.63,0.27,0.49]
["b",0.56999999999999995,0.3,0.73,0.42,0.66,0.24,0.56999999999999995,0.66,0.6,0.66,0.66,0.66,0.42,0.56999999999999995]
["c",0.73,0.53,0.86,0.57999999999999996,0.68,0.38,0.73,0.68,0.63,0.68,0.68,0.68,0.57999999999999996,0.73]
{"$rows_left_out":187}
{"sheet":"Irr System","index":10,"n_rows":49,"n_cols":5,"rows_kept":49,"cut":false,"hidden":true,"merged":[]}
["2-in-10"]
[null,null,null,"With SWM","Without SWM"]
["01",1,"Micro-sprinkler",1.18,1.18]
["02",2,"Overhead Drip",1.18,1.18]
["03",13,"Seepage/Furrow",2.5,1.67]
["12",4,"Low Volume",1.18,1.18]
{"$rows_left_out":44}
{"sheet":"InputControl","index":11,"n_rows":160,"n_cols":7,"rows_kept":160,"cut":false,"hidden":true,"merged":[]}
[]
[]
[]
[]
[]
[]
{"$rows_left_out":154}